program: Gaussian 09
title: 000259189
version: EM64L-G09RevD.01
frameworkgroup: C1[X(C11H10N2O3)]
method: RPBEPBE
basis: SDD
operation: Freq
keyword: #p
keyword: freq=noraman
keyword: PBEPBE/SDD
title: #p freq=noraman PBEPBE/SDD
converged: NO YES NO NO
title: Mulliken charges:
elementType: O O O N N C C C C C C C C C C C H H H H H H H H H H
charge: -0.263573 -0.238553 -0.253129 -0.390064 0.100092 0.170855 0.224254 0.326688 -0.524518 -0.364922 -0.314014 0.313944 -0.336582 -0.265901 -0.214594 -0.537535 0.320363 0.254356 0.269372 0.237629 0.255905 0.267387 0.264878 0.247993 0.224833 0.224835
chargesum: 0.00000
title: Mulliken charges with hydrogens summed into heavy atoms:
elementType: O O O N N C C C C C C C C C C C
charge: -0.263573 -0.238553 -0.253129 -0.069701 0.100092 0.170855 0.224254 0.326688 -0.270162 -0.095550 -0.076385 0.313944 -0.080677 0.001487 0.050285 0.160126
polarizability: 2.91477253e+02 -1.07821172e+01 1.79775549e+02 -1.35310908e-04 -1.47610126e-03 6.11306535e+01
1716.lowfreq: -0.0010 -0.0004 0.0003 1.7290 2.0016 2.9747 47.3161 58.5171 62.8193
frequency: 47.1305 58.5167 62.8155 96.0691 149.0838 159.0947 173.9740 225.6305 242.8345 246.8866 257.1684 322.1924 383.3230 402.8307 427.9774 462.4236 508.8719 552.6166 567.0010 589.3318 604.5673 640.2186 655.0980 681.8456 738.2825 756.6816 758.0556 807.3072 816.0550 834.4367 835.9686 855.6554 908.1937 943.3719 944.5187 991.6626 994.6698 1047.1596 1107.7898 1113.4095 1142.9674 1156.8584 1185.0157 1212.2468 1223.7571 1243.3132 1259.3207 1291.0509 1308.0424 1326.2811 1367.1869 1400.8595 1427.2993 1438.8470 1464.8024 1467.2074 1474.7301 1479.2339 1534.2818 1599.6304 1628.9063 1636.6805 2961.6392 3050.3931 3119.5003 3128.8077 3146.0521 3168.0213 3177.4489 3198.4384 3229.7298 3600.5121
redmass: 9.0043 7.2217 4.4408 3.7885 3.8435 3.9476 4.5959 2.2254 1.4343 7.6063 5.1689 3.6377 5.4778 4.2257 2.8941 6.7767 4.4248 4.3665 1.7486 7.4277 1.7001 3.5506 9.0667 4.9478 6.4337 5.4402 3.2760 1.5660 1.4749 1.7004 5.7282 1.7805 4.9188 1.3359 4.9851 4.5204 1.2387 2.9277 1.5385 1.2614 1.2228 1.3586 2.2497 2.0411 5.7338 1.6545 2.6222 1.6315 1.7573 3.9042 4.4410 4.1440 1.7586 1.8157 1.9672 1.0492 2.0746 1.8944 4.9758 6.5431 6.6765 6.6081 1.0330 1.1040 1.0884 1.0996 1.0897 1.0909 1.0960 1.0949 1.0982 1.0811
irintensity: 0.0020 3.0841 5.5089 5.6924 0.4338 3.4388 0.8495 0.5623 2.6719 0.8733 4.6646 1.8821 3.0999 10.8798 3.8692 4.7741 5.6839 3.1665 64.2289 2.6715 55.9854 1.1877 19.9524 0.0331 5.1582 41.2568 0.0418 77.9202 1.4529 21.5228 1.8860 40.4844 34.4523 0.0124 6.9669 41.0028 34.3420 19.2741 37.5885 0.1102 19.1687 0.3790 171.8407 294.4809 496.6254 22.5053 92.8120 32.0033 82.3333 32.4159 68.8340 6.5868 26.2885 43.0248 85.5896 14.6191 52.7266 46.3474 83.1616 39.0665 168.1127 317.8495 44.5278 45.8255 0.0124 24.9287 8.6388 4.8329 6.6906 7.5891 2.7413 110.0653
temp: 298.150 k
press: 1.00000 atm
elementType: 8 8 8 7 7 6 6 6 6 6 6 6 6 6 6 6 1 1 1 1 1 1 1 1 1 1
symmnumber: 1
zpe: 508531.2 jmol-1
zpe.correction: 0.193689 hartree
zpe.thermalcorrener: 0.207598 hartree
zpe.thermalcorrenthalpy: 0.208542 hartree
zpe.thermalcorrgfe: 0.152045 hartree
zpe.sumelectzpe: -759.103945 hartree
zpe.sumelectthermal: -759.090037 hartree
zpe.sumelectthermalent: -759.089092 hartree
zpe.sumelectthermalfe: -759.145589 hartree
dipole: 6.3054 -4.9327 0.0011
dipole: 8.0055
quadrupole: -127.4206 -67.6834 -96.3474
quadrupole: 11.6564 -0.0052 0.0028
quadrupole: -30.2702 29.4671 0.8031 11.6564 -0.0052 0.0028
hfenergy: -759.2976345 hartree
pointgroup: C01 [X(C11H10N2O3)]
dipole: 2.5241334 -1.8838471 0.0031945 debye
dipolederiv: -0.6571774 -0.4071681 0.0001435 -0.7998605 -1.4726345 0.000525 0.000452 0.0007233 -0.2989991 -1.3741016 -0.0086041 -0.0003844 -0.0659836 -0.4459568 0.0002335 -0.0009181 0.0001253 -0.261017 -0.438046 -0.0647122 -0.0001213 0.503427 -0.9686495 0.0007639 -0.0007329 0.0009808 -0.2490777 -1.0029344 0.5636434 -0.0008224 0.335686 -0.5426862 0.0004035 -0.0006202 0.0005086 -0.2386601 2.109138 -0.2564865 0.0011546 -1.1588281 1.4029573 -0.0016745 0.0023219 -0.0014187 0.1843686 0.6520167 0.0960419 0.0002421 0.2543217 0.0117535 0.0001293 0.0000309 0.0000731 0.0097882 0.0453021 0.0455701 -0.0000132 0.5928402 0.0181937 0.0002757 -0.0004415 0.0000053 0.0070759 -0.6795905 0.156799 -0.0004374 1.1403381 -0.5371719 0.000904 -0.0011158 0.0004249 -0.0758508 -0.4869109 -0.2732839 0.0000745 -0.1889949 -0.0950016 -0.0001805 0.0000232 -0.0002149 -0.2108562 0.3242654 -0.6057592 0.0006826 -1.1196887 0.5352581 -0.0010547 0.001102 -0.0007885 -0.1102776 0.2684468 0.0378344 0.0001714 0.043142 0.1137217 -0.0001898 0.0001644 -0.0001961 -0.1562718 0.6711214 0.6035579 -0.0001901 0.7538083 1.1750334 -0.0004751 -0.0003072 -0.0005591 0.1008758 -0.0131563 0.0438364 0.000045 -0.315045 -0.3484462 -0.0000218 0.0003178 0.0001496 -0.1838696 1.6114717 -0.5379651 0.0012115 -0.5314775 0.2124884 -0.0004012 0.0013147 -0.0005122 -0.0220117 -1.6196863 0.6486581 -0.0013072 0.4716606 -0.1252081 0.0002308 -0.0010753 0.0002679 -0.1765571 0.0951331 -0.2563915 0.0000881 0.2434532 0.7694551 -0.0002247 -0.0002958 -0.000463 0.3243704 0.1532581 0.0123906 -0.0000949 -0.0837065 0.2732699 0.0000082 -0.0000182 0.0000515 0.338619 0.0641659 0.0979702 -0.0001224 0.0429307 -0.0162698 0.0001588 -0.0000902 0.000187 0.1642854 0.0363029 -0.0529677 -0.0000305 -0.0424914 0.0585026 0.0000882 -0.0000461 0.0000835 0.1974128 0.0382346 0.0588412 -0.0001093 0.1052026 -0.0612163 0.000232 -0.0001408 0.000209 0.1731972 -0.0619761 -0.0050165 -0.0001054 -0.0239485 0.1054392 0.0000402 -0.0000893 0.0000501 0.1715244 0.1127306 -0.0373031 0.0000175 -0.0348571 0.0156399 0.0000827 0.0000015 0.0000936 0.1530712 0.0689666 -0.0009404 -0.0000459 0.0394263 -0.019943 0.0002139 -0.0000231 0.0001467 0.2053374 -0.0209453 -0.1380771 0.0000398 -0.1146757 -0.0589754 0.000089 0.0000221 0.0000789 0.1248574 0.0518902 0.1398773 0.120253 -0.023283 0.0002097 0.0209553 0.0854809 -0.0368998 -0.0855622 0.0520807 0.1396548 -0.1203394 -0.0233963 0.0002368 -0.0211116 -0.0853168 0.0368929 -0.0857726 unknown
polarizability: 291.9089978|-8.2360821|179.343661|0.12061|-0.1010174|61.1307959 unknown
InChI: InChI=1S/C11H10N2O3/c1-16-9-2-3-11-10(6-9)8(7-12-11)4-5-13(14)15/h2-7,12H,1H3
charge 0 multiplicity 1
26 atoms
O  3.526911 2.000602 -0.000152
O  -5.424734 0.332158 -0.003422
O  -3.848052 1.999978 -0.004185
N  0.570841 -2.730641 0.00215
N  -4.189356 0.74474 -0.002606
C  0.690735 -0.448513 0.000426
C  1.472141 -1.647735 0.001721
C  -0.717357 -0.846817 0.000095
C  1.336788 0.813615 -0.000252
C  -0.73096 -2.260489 0.001186
C  2.884141 -1.628633 0.002369
C  2.748649 0.832603 0.000393
C  3.514314 -0.375269 0.00169
C  -1.840244 0.055087 -0.001101
C  -3.169081 -0.281412 -0.001395
C  2.819149 3.283101 -0.001477
H  0.838229 -3.713479 0.003026
H  0.753525 1.738404 -0.001235
H  -1.577298 -2.944666 0.001325
H  3.478102 -2.54828 0.003364
H  4.604562 -0.289425 0.002131
H  -1.628713 1.133356 -0.001866
H  -3.58965 -1.287681 -0.00077
H  3.609539 4.047454 -0.001708
H  2.190542 3.395776 0.903098
H  2.191376 3.394368 -0.906806
