program: Gaussian 09
title: 000023507
version: EM64L-G09RevD.01
frameworkgroup: C1[X(C13H17NO4)]
method: RPBEPBE
basis: SDD
operation: Freq
keyword: #p
keyword: freq=noraman
keyword: PBEPBE/SDD
title: #p freq=noraman PBEPBE/SDD
converged: YES YES NO NO
title: Mulliken charges:
elementType: O O O O N C C C C C C C C C C C C C H H H H H H H H H H H H H H H H H
charge: -0.267828 -0.299201 -0.338532 -0.271753 -0.372192 -0.016670 -0.005041 -0.119372 -0.722924 -0.709696 0.241967 0.227620 -0.348281 -0.324878 -0.247184 -0.220633 0.290325 -0.606480 0.210372 0.206783 0.239425 0.213089 0.225185 0.239046 0.240198 0.213584 0.221627 0.268486 0.302272 0.226671 0.228600 0.342250 0.230918 0.231231 0.271016
chargesum: 0.00000
title: Mulliken charges with hydrogens summed into heavy atoms:
elementType: O O O O N C C C C C C C C C C C C C
charge: -0.267828 -0.299201 -0.338532 -0.271753 -0.029942 0.193703 0.201742 0.120053 -0.045605 -0.034287 0.241967 0.227620 -0.079795 -0.022606 -0.020513 0.007966 0.290325 0.126685
polarizability: 1.92521828e+02 -8.48807673e+00 1.86891919e+02 4.27098449e+00 1.21550518e+01 1.02884024e+02
1716.lowfreq: -4.7610 -2.5200 -0.0008 -0.0006 -0.0004 4.4570 14.2388 27.2001 33.0945
frequency: 13.9917 27.1405 33.0598 55.3085 68.7516 97.2965 99.7810 137.2534 165.7996 170.6118 196.0217 206.7463 216.8133 241.8914 257.6472 283.2691 311.4873 330.8904 353.9723 382.5879 428.7209 484.0882 514.8394 537.3432 559.5947 601.9547 603.2578 607.6627 667.6053 696.2837 708.4628 733.6384 768.1230 783.3471 799.1827 815.0508 832.9705 850.4314 882.6613 896.4388 899.8639 966.5367 976.7281 991.3488 996.4294 1036.7343 1057.2848 1072.2413 1074.0078 1098.6799 1120.7732 1126.4721 1140.7091 1147.0509 1164.1232 1174.8832 1183.2725 1191.6339 1220.6147 1246.1477 1270.1166 1277.7257 1298.5593 1319.1722 1326.6772 1373.4442 1385.9967 1391.2321 1392.5782 1431.5822 1436.4770 1457.9296 1461.7255 1462.6790 1472.0793 1476.5524 1479.2951 1483.7923 1514.9808 1594.4299 1604.8300 1692.4763 2955.9675 2976.3069 2981.7435 2989.1974 2992.0089 3040.6049 3059.7600 3083.8382 3088.0080 3098.7503 3100.6165 3114.3358 3132.4634 3152.1132 3170.6733 3201.9260 3570.8991
redmass: 4.8428 4.1771 4.1480 4.3609 3.9678 1.2274 3.0867 3.8161 3.5597 4.5070 1.1542 1.0404 3.7927 3.6081 4.0301 5.3521 4.5876 2.6892 4.2742 4.4868 4.0206 4.0961 3.2320 4.1081 5.3652 1.5462 2.8256 4.6439 8.4265 8.7998 6.5663 5.2711 1.3928 3.7543 2.4665 2.9530 3.4337 2.6243 3.2707 1.9654 4.3794 1.4039 1.2511 1.3802 3.3830 2.1875 2.6177 1.7947 3.7546 2.4489 2.7159 1.2846 2.1986 1.7081 1.3348 1.9432 1.7077 2.0382 2.4970 1.3978 1.4287 1.3289 1.1519 1.3331 1.3797 1.7141 6.1850 1.2573 1.2405 1.1659 2.2614 1.4525 1.0444 1.0619 2.1805 1.0473 1.0489 1.0445 1.3941 7.0242 6.8204 9.3243 1.0831 1.0867 1.0354 1.0364 1.0363 1.0872 1.1026 1.0987 1.0990 1.1000 1.1000 1.0983 1.0863 1.0927 1.0965 1.0947 1.0774
irintensity: 0.0539 4.3750 6.1807 1.8419 0.0574 0.3901 1.8600 2.2168 1.2735 3.0788 0.1229 0.3268 0.9871 0.9512 1.4739 4.9675 8.3076 3.7111 14.5015 5.1735 2.9889 5.8944 5.1564 0.2078 8.8105 80.6181 36.4024 21.7798 9.7831 18.8283 10.3454 7.1855 88.2328 3.4661 15.8805 10.6978 15.5205 1.8782 30.6722 18.6940 73.1335 21.1161 13.4202 12.0294 132.6428 7.1372 163.0430 16.1444 62.5375 169.5925 9.5380 0.5512 2.4310 139.3127 134.9044 3.1279 291.9355 127.8822 14.9461 27.8632 13.6195 3.8367 18.3982 24.0671 1.5906 1.0890 10.5907 23.0985 23.8606 27.8663 91.0357 217.8745 17.4516 0.0563 31.2307 10.2121 10.9570 16.1807 151.4720 5.7623 18.5555 261.1796 12.1866 70.1245 83.0024 16.2759 27.8731 29.8266 35.6870 31.6374 24.8816 13.1043 40.6894 3.8664 4.6511 18.9530 15.6311 5.2113 40.1806
temp: 298.150 k
press: 1.00000 atm
elementType: 8 8 8 8 7 6 6 6 6 6 6 6 6 6 6 6 6 6 1 1 1 1 1 1 1 1 1 1 1 1 1 1 1 1 1
symmnumber: 1
zpe: 739418.1 jmol-1
zpe.correction: 0.281629 hartree
zpe.thermalcorrener: 0.299958 hartree
zpe.thermalcorrenthalpy: 0.300902 hartree
zpe.thermalcorrgfe: 0.232656 hartree
zpe.sumelectzpe: -859.865247 hartree
zpe.sumelectthermal: -859.846919 hartree
zpe.sumelectthermalent: -859.845975 hartree
zpe.sumelectthermalfe: -859.914221 hartree
dipole: -1.9621 -3.0342 0.7417
dipole: 3.6887
quadrupole: -97.4447 -92.6058 -109.1109
quadrupole: -7.6517 -7.1378 2.9896
quadrupole: 2.2758 7.1146 -9.3904 -7.6517 -7.1378 2.9896
hfenergy: -860.1468769 hartree
pointgroup: C01[X(C13H17N1O4)]
dipole: -0.9365405 1.0918449 -0.1919878 debye
polarizability: 189.3441994|9.9996325|188.002284|-9.9816828|14.9050914|104.951288 unknown
InChI: InChI=1S/C13H17NO4/c1-8-9(2)17-12(16-8)10-6-4-5-7-11(10)18-13(15)14-3/h4-9,12,14H,1-3H3
charge 0 multiplicity 1
35 atoms
O  -1.174247 1.356356 0.06045
O  -2.351463 -0.20309 1.398264
O  1.669391 0.469139 0.421229
O  3.825553 0.347213 -0.609133
N  2.920666 2.327397 0.280335
C  -2.517134 1.162001 -0.548575
C  -3.340233 0.626093 0.646204
C  -0.997385 0.218185 0.995554
C  -2.976041 2.494764 -1.130398
C  -4.544399 -0.243569 0.290551
C  -0.240986 -0.94421 0.360908
C  1.139266 -0.795603 0.051865
C  -0.86181 -2.180117 0.079164
C  1.883602 -1.839426 -0.540849
C  -0.138184 -3.235496 -0.521116
C  1.227713 -3.057915 -0.831295
C  2.912794 0.992266 -0.039988
C  4.07373 3.18745 0.007201
H  -2.453365 0.37912 -1.334707
H  -3.642776 1.475464 1.294089
H  -0.454496 0.632364 1.862448
H  -3.983777 2.397782 -1.573866
H  -3.005765 3.270115 -0.344752
H  -2.284068 2.828857 -1.921932
H  -4.992334 -0.672812 1.20286
H  -5.317984 0.359754 -0.219425
H  -4.247162 -1.073717 -0.374589
H  -1.912307 -2.300937 0.359344
H  2.939856 -1.694017 -0.771015
H  -0.633953 -4.188502 -0.734356
H  1.798325 -3.870871 -1.293983
H  2.062812 2.711707 0.678387
H  4.466655 3.637148 0.937631
H  3.811249 3.996553 -0.699106
H  4.862457 2.567356 -0.4473
