program: Gaussian 09
title: 000259197
version: EM64L-G09RevD.01
frameworkgroup: C1[X(C16H18O2)]
method: RPBEPBE
basis: SDD
operation: Freq
keyword: #pfreq=noraman
keyword: PBEPBE/SDD
title: #p freq=noraman PBEPBE/SDD
converged: NO YES NO NO
title: Mulliken charges:
elementType: O O C C C C C C C C C C C C C C C C H H H H H H H H H H H H H H H H H H
charge: -0.277813 -0.238997 0.052659 0.539250 -0.476404 0.422743 -0.643057 0.061642 -0.534973 -0.761979 -0.541937 -0.574081 0.172736 -0.423125 0.202229 -0.276316 -0.398190 -0.534363 0.234921 0.211618 0.224310 0.238000 0.245821 0.256804 0.227619 0.233964 0.229407 0.251594 0.232300 0.256466 0.233471 0.223820 0.242651 0.220785 0.222231 0.244194
chargesum: 0.00000
title: Mulliken charges with hydrogens summed into heavy atoms:
elementType: O O C C C C C C C C C C C C C C C C
charge: -0.277813 -0.238997 0.052659 0.539250 -0.029865 0.422743 -0.180747 0.061642 -0.032348 -0.070989 -0.058042 -0.317615 0.172736 -0.189654 0.202229 -0.052497 -0.155539 0.152848
polarizability: 2.43975557e+02 1.60740627e+00 1.73441214e+02 5.47640311e+00 8.67386364e-03 1.14167560e+02
1716.lowfreq: -7.0727 0.0003 0.0006 0.0007 7.2030 17.7053 41.7779 54.8341 90.1813
frequency: 41.7575 54.6520 90.1784 120.2691 152.4307 169.1991 195.0061 210.6614 227.7581 245.4043 252.0826 261.1267 281.7387 301.7486 309.7526 360.7145 373.3809 415.1480 448.5715 473.7338 510.8742 515.9775 537.4038 547.2149 573.8764 614.9781 625.7447 643.8383 690.9856 728.3618 758.5915 781.3091 790.3579 795.3181 850.2774 851.3043 872.0427 884.7325 928.1543 942.1753 956.0912 960.3814 987.1747 1021.0268 1024.6001 1039.3711 1078.5952 1084.8757 1096.1046 1113.0509 1137.7821 1145.9288 1154.0916 1178.4084 1185.9015 1190.0572 1201.9604 1207.4747 1230.7620 1240.9163 1250.3251 1278.2078 1291.9170 1319.6527 1342.5720 1344.4655 1353.0088 1384.0011 1390.2567 1431.8096 1441.9961 1452.2335 1453.8106 1460.2078 1465.4164 1466.7503 1469.8552 1472.4973 1478.6188 1482.8458 1579.5133 1589.7740 1605.0451 1634.3981 2960.8431 2974.6084 2982.0871 2983.2256 2987.1016 2993.1640 3049.0574 3051.1716 3052.8932 3058.0485 3060.4377 3085.5253 3088.0991 3123.8621 3124.9986 3127.6870 3148.0977 3169.8815
redmass: 5.6084 3.6187 3.5509 3.5653 4.2189 2.6611 1.4539 2.7775 1.6316 1.8534 2.4972 2.3165 2.2650 3.7937 3.0153 4.2981 2.9019 3.1830 3.5955 5.1149 4.0910 3.5831 3.0231 4.2348 3.1898 4.4245 4.5990 3.4264 3.1762 1.9764 2.4079 2.6146 2.4888 4.0931 2.1009 2.5200 1.4388 1.4267 1.9442 1.9698 2.6579 1.3413 2.2512 2.1531 2.9219 2.1041 2.3329 2.2979 2.3177 1.2608 2.4356 1.3951 1.2880 1.5179 1.5576 1.4033 1.5177 2.5794 1.6164 2.3789 2.0308 2.0841 1.4818 1.4486 1.9526 1.5831 1.7806 1.8263 2.2303 1.3304 1.0799 1.6920 1.7775 1.1184 1.0867 1.0512 1.1882 1.0872 1.2877 1.1230 9.6027 6.7767 7.0842 7.8773 1.0328 1.0656 1.0630 1.0635 1.0370 1.0603 1.1039 1.0986 1.0932 1.0992 1.0982 1.0998 1.1003 1.0994 1.0915 1.0858 1.0928 1.0964
irintensity: 1.0799 2.5293 5.7226 0.6650 0.8006 6.5047 1.0300 2.0809 0.7317 0.8514 1.8388 0.5525 0.3477 2.9272 0.3042 3.9369 1.0529 2.3869 4.0985 0.1578 7.4891 0.3029 1.4026 1.5374 1.0467 1.4400 5.1933 1.4576 13.1081 17.5152 17.7711 5.3046 40.6947 7.2486 2.2268 3.4841 1.0781 15.2624 4.7750 6.6587 11.9800 0.4162 5.4273 43.3660 77.2714 6.4236 4.3217 15.6503 4.9409 0.0937 11.2336 6.5348 0.4825 7.9897 5.3943 2.5767 16.1461 3.0071 13.9469 124.2067 60.3945 27.2446 2.4996 11.1221 15.6210 3.8001 6.9785 18.3019 4.5398 28.0996 19.4769 37.5182 49.0274 10.3184 17.4598 12.2283 7.5900 2.9663 8.7915 14.9136 207.2397 47.3149 29.3353 156.6639 76.6600 16.0703 10.2624 15.0269 37.0785 22.8800 44.6743 22.2433 17.2444 27.4638 25.6476 19.0411 38.1378 22.1284 9.8427 5.6587 21.8460 19.0276
temp: 298.150 k
press: 1.00000 atm
elementType: 8 8 6 6 6 6 6 6 6 6 6 6 6 6 6 6 6 6 1 1 1 1 1 1 1 1 1 1 1 1 1 1 1 1 1 1
symmnumber: 1
zpe: 784291.8 jmol-1
zpe.correction: 0.298721 hartree
zpe.thermalcorrener: 0.314766 hartree
zpe.thermalcorrenthalpy: 0.315710 hartree
zpe.thermalcorrgfe: 0.256127 hartree
zpe.sumelectzpe: -769.620191 hartree
zpe.sumelectthermal: -769.604145 hartree
zpe.sumelectthermalent: -769.603201 hartree
zpe.sumelectthermalfe: -769.662785 hartree
dipole: 6.0590 1.6375 1.4453
dipole: 6.4406
quadrupole: -116.2395 -100.4880 -108.4889
quadrupole: -9.2756 -10.0741 -2.7285
quadrupole: -7.8340 7.9174 -0.0834 -9.2756 -10.0741 -2.7285
hfenergy: -769.9189115 hartree
pointgroup: C01 [X(C16H18O2)]
dipole: 2.4684763 0.4785938 0.3136296 debye
polarizability: 243.7371978|-4.6671392|173.1447473|-5.4272873|-5.4438467|114.7023863 unknown
InChI: InChI=1S/C16H18O2/c1-16-9-8-12(17)10-11(16)6-7-13-14(16)4-3-5-15(13)18-2/h3-5,10H,6-9H2,1-2H3
charge 0 multiplicity 1
36 atoms
O  3.268021 -1.658843 -0.519872
O  -5.028787 -0.636366 -0.574747
C  -1.059093 0.63984 0.410286
C  -1.573311 -0.790641 0.614828
C  -1.875606 1.315098 -0.741034
C  0.446257 0.660934 0.042746
C  -0.590191 -1.771169 1.2073
C  1.220551 -0.525098 -0.048038
C  0.644324 -1.892889 0.280044
C  -1.26455 1.415647 1.757886
C  -3.401963 1.192036 -0.552607
C  -2.850934 -1.163589 0.28401
C  -3.847674 -0.250832 -0.307918
C  1.060256 1.913838 -0.233969
C  2.589001 -0.426733 -0.440844
C  2.413322 1.990896 -0.606184
C  3.19388 0.818121 -0.719007
C  4.682787 -1.632626 -0.89473
H  -1.585563 0.834845 -1.695705
H  -1.596105 2.381783 -0.821537
H  -0.246394 -1.409224 2.197875
H  -1.061725 -2.758148 1.35798
H  0.358379 -2.418252 -0.653075
H  1.422291 -2.517007 0.753623
H  -0.922993 2.46094 1.658428
H  -2.327187 1.421052 2.056454
H  -0.682124 0.949502 2.571956
H  -3.947738 1.578302 -1.431897
H  -3.741465 1.797993 0.312138
H  -3.193953 -2.190531 0.463489
H  0.475988 2.837101 -0.159918
H  2.869026 2.964972 -0.814748
H  4.24408 0.887132 -1.015814
H  5.282799 -1.051187 -0.167907
H  4.822612 -1.213201 -1.909903
H  5.002283 -2.685094 -0.881991
