program: Gaussian 09
title: 000259224
version: EM64L-G09RevD.01
frameworkgroup: C1[X(C11H16N4O3)]
method: RPBEPBE
basis: SDD
operation: Freq
keyword: #p
keyword: freq=noraman
keyword: PBEPBE/SDD
title: #p freq=noraman PBEPBE/SDD
converged: YES YES NO NO
title: Mulliken charges:
elementType: O O O N N N N C C C C C C C C C C C H H H H H H H H H H H H H H H H
charge: -0.289811 -0.273209 -0.266400 -0.220582 -0.197243 -0.435104 -0.655978 0.105054 0.349803 0.113036 0.235254 -0.663313 -0.598469 0.367079 -0.771140 -0.484479 0.155003 -0.780912 0.327392 0.243630 0.301849 0.235398 0.250587 0.273469 0.248657 0.376950 0.341420 0.276506 0.198038 0.257547 0.275044 0.242730 0.248994 0.213198
chargesum: 0.00000
title: Mulliken charges with hydrogens summed into heavy atoms:
elementType: O O O N N N N C C C C C C C C C C C
charge: -0.289811 -0.273209 -0.266400 -0.220582 -0.197243 -0.107712 0.062391 0.105054 0.349803 0.113036 0.235254 0.117564 0.174244 0.367079 -0.039049 -0.209435 0.155003 -0.075990
polarizability: 2.47869495e+02 3.90151559e+00 1.74423693e+02 -3.20534466e+00 1.03191362e+00 1.09399947e+02
1716.lowfreq: -8.7081 -5.3709 -0.0008 -0.0007 -0.0007 5.5696 35.6999 51.6726 59.8901
frequency: 35.6620 51.6560 59.8706 62.1891 85.7719 90.2241 104.1187 114.0609 117.3553 142.9030 181.7937 200.7247 218.0115 226.9827 237.3780 290.5234 306.3718 321.3731 337.6851 367.6429 375.1171 392.6634 398.2559 407.4939 449.5552 452.9382 501.5782 517.2145 542.0571 597.7477 613.4318 619.6255 638.1924 649.0540 661.1039 704.4563 730.6435 752.4887 833.0257 874.1008 912.2385 929.9371 952.8286 995.4569 1020.0847 1021.8485 1040.5910 1051.0260 1074.1758 1123.6726 1131.1796 1146.9974 1179.9953 1203.3379 1240.1614 1260.9339 1275.8091 1339.1673 1352.3455 1368.4373 1379.4282 1406.5873 1409.8448 1433.2799 1439.2316 1447.1663 1460.0142 1461.4737 1469.8296 1475.2911 1478.4924 1493.1561 1504.0090 1527.8054 1543.3796 1567.6122 1599.4385 1612.4276 1631.3448 1663.2386 2979.9245 2980.2368 2988.8600 3013.2172 3066.3395 3067.3541 3074.5180 3106.1523 3111.5401 3118.5300 3120.7827 3122.7146 3140.5340 3414.5383 3450.0693 3652.5083
redmass: 4.5639 2.9740 2.7875 1.4129 2.8707 1.5916 2.4294 1.0659 3.8938 4.2019 4.0564 2.3395 1.9359 2.6387 4.4006 3.8005 3.1468 3.0538 3.1912 3.3233 3.5182 1.4421 5.3007 4.4647 7.1278 4.3559 5.6826 1.2789 2.4595 3.2011 3.0198 4.5059 7.2046 1.8756 3.8168 10.0319 8.6967 4.6314 3.5093 1.3288 3.1158 3.3422 2.4970 1.9195 1.7101 1.5937 1.6004 2.6801 1.8502 1.2963 1.3075 2.2410 2.2733 3.7281 2.9888 3.5246 5.8335 2.2452 3.8077 1.2320 2.2379 1.3007 1.2117 1.3579 1.1139 1.0985 1.1058 1.0918 1.4432 1.0549 1.0623 1.7308 1.1038 2.1958 6.0844 7.5275 4.6152 4.3737 1.8340 2.9072 1.0370 1.0362 1.0397 1.0328 1.1027 1.0965 1.0977 1.1024 1.0994 1.0962 1.0970 1.0896 1.1024 1.0587 1.0750 1.0920
irintensity: 2.6849 2.5509 2.0523 1.8627 1.8032 1.9309 0.3783 0.4198 11.5926 5.4419 2.8824 4.6914 7.8988 2.1037 5.2838 4.2320 1.7716 6.7318 11.8857 10.0513 16.7107 51.1611 17.8870 20.1028 9.6007 15.4450 11.9138 118.4115 1.1264 28.5404 44.1301 8.5345 6.4351 79.1020 24.5648 10.3754 11.3518 11.1287 1.1739 12.8234 32.6279 6.0787 33.7907 5.7246 8.3743 5.6859 18.3966 1.9110 39.3130 0.2540 0.0754 13.0327 100.5873 39.9672 3.7780 3.1012 65.7618 23.9260 64.8051 47.5739 19.8518 12.1602 39.2822 207.4020 80.0025 16.2959 35.1482 27.4944 41.6808 12.2546 12.5592 324.5734 82.0832 60.1247 642.7131 366.6135 188.7232 253.0685 217.9135 370.1534 8.3296 42.5894 21.7866 30.7842 21.9365 18.9392 13.7799 16.3947 15.7227 4.1872 1.6835 12.2750 0.5521 146.1456 92.6901 85.2870
temp: 298.150 k
press: 1.00000 atm
elementType: 8 8 8 7 7 7 7 6 6 6 6 6 6 6 6 6 6 6 1 1 1 1 1 1 1 1 1 1 1 1 1 1 1 1
symmnumber: 1
zpe: 707556.1 jmol-1
zpe.correction: 0.269494 hartree
zpe.thermalcorrener: 0.288947 hartree
zpe.thermalcorrenthalpy: 0.289891 hartree
zpe.thermalcorrgfe: 0.221454 hartree
zpe.sumelectzpe: -872.128772 hartree
zpe.sumelectthermal: -872.109319 hartree
zpe.sumelectthermalent: -872.108374 hartree
zpe.sumelectthermalfe: -872.176812 hartree
dipole: -1.9119 3.7237 -1.7599
dipole: 4.5408
quadrupole: -140.6560 -99.0514 -102.9060
quadrupole: 1.5185 2.9074 -1.3171
quadrupole: -26.4515 15.1530 11.2985 1.5185 2.9074 -1.3171
hfenergy: -872.3982656 hartree
pointgroup: C01 [X(C11H16N4O3)]
dipole: -0.9696222 1.3873948 0.5714199 debye
polarizability: 243.6961497|21.4713133|144.3630914|-5.6668624|31.9288991|143.6338943 unknown
InChI: InChI=1S/C11H16N4O3/c1-6(5-7(2)16)13-8-9(12)14(3)11(18)15(4)10(8)17/h5,13H,12H2,1-4H3
charge 0 multiplicity 1
34 atoms
O  -1.095705 -2.404161 -1.821587
O  -4.082449 -0.181569 1.037684
O  4.798366 0.701234 -0.146201
N  -1.994569 0.799989 0.595652
N  -2.59444 -1.30919 -0.36765
N  0.825486 -0.477576 -1.529967
N  0.068942 1.868761 0.079751
C  -0.372732 -0.37574 -0.771504
C  -0.743663 0.765315 -0.043233
C  -1.331446 -1.434396 -1.027885
C  -2.960963 -0.238782 0.455857
C  -2.372452 1.943319 1.45082
C  -3.60447 -2.374952 -0.558495
C  2.133259 -0.22196 -1.143861
C  3.139622 -0.317063 -2.270522
C  2.468711 0.101547 0.176782
C  3.813758 0.452318 0.632973
C  4.022172 0.49442 2.152104
H  0.696977 -1.030686 -2.387267
H  -1.655613 2.06775 2.282354
H  -3.366231 1.717694 1.864695
H  -2.443418 2.878282 0.863988
H  -3.871312 -2.819832 0.413764
H  -3.157896 -3.128969 -1.222652
H  -4.517274 -1.955385 -1.012269
H  1.064271 1.772248 -0.151307
H  -0.238286 2.70743 0.564694
H  4.069621 -0.791511 -1.924057
H  2.720373 -0.876143 -3.127885
H  3.433886 0.688716 -2.619359
H  1.707331 -0.045911 0.952512
H  4.257934 -0.523653 2.518585
H  4.877912 1.146931 2.389022
H  3.123299 0.842424 2.692258
