program: Gaussian 09
title: 000259202
version: EM64L-G09RevD.01
frameworkgroup: C1[X(C15H22O2)]
method: RPBEPBE
basis: SDD
operation: Freq
keyword: #pfreq=noraman
keyword: PBEPBE/SDD
title: #p freq=noraman PBEPBE/SDD
converged: YES YES NO NO
title: Mulliken charges:
elementType: O O C C C C C C C C C C C C C C C H H H H H H H H H H H H H H H H H H H H H H
charge: -0.275758 -0.252777 -0.354964 -0.377888 -0.399748 -0.567715 -0.503684 0.505102 0.258402 0.041235 -0.417367 -0.412047 -0.228404 -0.229729 -0.685883 -0.683494 -0.244740 0.213994 0.192583 0.209180 0.205512 0.211763 0.221363 0.207635 0.206150 0.223185 0.231087 0.233902 0.230742 0.230567 0.207513 0.232176 0.222542 0.212814 0.248024 0.218423 0.222055 0.222068 0.226182
chargesum: 0.00000
title: Mulliken charges with hydrogens summed into heavy atoms:
elementType: O O C C C C C C C C C C C C C C C
charge: -0.275758 -0.252777 0.051613 0.036804 0.033379 -0.153931 -0.049413 0.505102 0.258402 0.275137 -0.186626 -0.181480 -0.006349 -0.007661 -0.023651 -0.004233 -0.018559
polarizability: 2.05323109e+02 2.11665339e+00 1.67260119e+02 1.25906065e+01 -1.74375209e+00 1.21633448e+02
1716.lowfreq: -15.0033 -7.6262 -0.0006 0.0006 0.0007 3.2117 10.9182 14.4602 16.7542
frequency: -11.8137 11.2673 16.4790 32.7542 59.2971 63.9580 77.1743 103.6619 109.8743 141.6877 181.3921 185.0239 208.0627 238.9090 268.0135 306.1425 327.9232 335.6135 380.0626 403.2607 409.2990 421.5178 462.2892 510.6197 580.0236 582.1834 617.6897 688.0003 704.9893 734.9550 759.2555 761.5212 782.2346 805.8291 848.0545 852.9950 873.5899 897.9998 915.0399 923.9297 931.4810 941.3500 974.7639 984.1639 989.8132 992.9552 1024.9707 1029.6462 1048.2107 1050.4956 1066.7994 1092.0148 1100.5714 1114.6016 1155.4333 1168.3599 1171.2680 1182.6320 1186.2660 1216.2874 1218.1747 1237.7391 1258.3815 1281.1875 1293.8958 1306.3195 1313.3187 1323.3211 1327.4938 1338.2919 1342.3592 1362.3399 1378.6498 1382.1905 1394.5200 1439.8482 1452.4890 1456.6680 1462.2108 1464.6203 1465.4551 1471.1234 1475.6318 1483.6404 1485.4313 1488.1128 1592.7119 1614.0712 1631.4325 2962.6177 2967.3968 2978.5027 2982.6599 2987.2621 2991.5754 3002.1686 3015.8530 3020.9562 3026.1636 3040.5985 3053.8747 3082.3563 3089.2753 3091.6592 3096.8127 3102.0540 3112.4280 3112.5041 3129.7627 3140.9760 3160.5426
redmass: 3.7368 3.7084 3.7723 3.1334 4.3852 5.0398 3.0694 3.6157 1.9577 2.7184 3.1545 1.0560 1.9303 1.5067 3.7456 2.3491 3.2207 2.4186 3.6593 2.8168 2.7473 2.7722 2.6933 3.3505 4.0646 4.2260 6.3557 2.5142 1.7239 1.1639 2.0334 3.2059 1.4502 3.7683 2.4978 1.3383 2.1010 1.8652 1.4762 1.2252 2.2078 1.3925 1.3888 2.9845 6.1702 1.3476 2.3496 2.1297 2.6009 2.2499 2.0898 2.0815 1.6721 1.3434 2.0625 1.6499 1.0576 1.8663 1.1145 2.2180 1.7486 1.4091 1.3580 1.1991 1.0966 1.2723 1.2983 1.4662 1.2512 1.3744 1.4406 1.5713 1.2628 7.7997 1.2303 2.1774 1.0976 1.0527 1.0621 1.0824 1.0666 1.0499 1.1141 2.2403 1.0545 1.1004 6.0439 6.1821 10.0793 1.0598 1.0593 1.0597 1.0597 1.0356 1.0358 1.0973 1.0765 1.0851 1.0864 1.1030 1.1039 1.0995 1.1041 1.0987 1.1007 1.1004 1.0867 1.0871 1.0906 1.0958 1.1014
irintensity: 0.4931 0.0934 0.0343 0.0235 0.9858 1.0245 0.3885 2.0507 0.0095 1.9810 1.3867 0.0772 2.4296 2.3014 2.0204 1.6251 0.1398 0.0948 4.5844 0.0005 6.3625 1.7818 2.9335 10.6793 3.6171 5.5638 0.0686 5.0302 53.2184 4.3747 34.8197 10.2474 1.1588 5.6121 7.3342 1.2407 2.5861 0.7387 1.7527 2.8352 52.5717 2.5649 0.0170 3.9035 0.1164 0.2797 22.4510 75.8677 31.9753 3.9592 16.7506 43.7328 83.3038 30.6883 11.0342 74.3674 0.8820 10.6539 0.1752 4.3369 86.9582 17.5154 40.8393 0.9773 0.8331 4.2295 6.2788 5.6451 0.1234 3.1025 4.9298 1.6915 30.5781 0.1489 15.8737 6.3997 15.8790 5.7909 1.7118 3.9312 2.4724 7.0842 0.4303 22.0711 14.4145 23.8467 1.3662 12.2176 166.6459 1.7809 6.4589 13.4178 100.2653 15.5239 22.1610 1.5819 9.9769 6.9149 7.2272 1.2787 110.0388 5.7183 24.6824 54.9263 19.2260 35.3537 9.7362 8.9585 10.4770 48.6986 25.4696
temp: 298.150 k
press: 1.00000 atm
elementType: 8 8 6 6 6 6 6 6 6 6 6 6 6 6 6 6 6 1 1 1 1 1 1 1 1 1 1 1 1 1 1 1 1 1 1 1 1 1 1
symmnumber: 1
zpe: 878622.9 jmol-1
zpe.correction: 0.334650 hartree
zpe.thermalcorrener: 0.352566 hartree
zpe.thermalcorrenthalpy: 0.353510 hartree
zpe.thermalcorrgfe: 0.284901 hartree
zpe.sumelectzpe: -733.947308 hartree
zpe.sumelectthermal: -733.929392 hartree
zpe.sumelectthermalent: -733.928447 hartree
zpe.sumelectthermalfe: -733.997056 hartree
dipole: 0.5460 0.7964 -1.7290
dipole: 1.9803
quadrupole: -98.1854 -93.7396 -111.7268
quadrupole: 7.3588 -2.3760 3.3478
quadrupole: 3.0318 7.4777 -10.5095 7.3588 -2.3760 3.3478
hfenergy: -734.2819575 hartree
pointgroup: C01 [X(C15H22O2)]
dipole: 0.1658113 0.4051375 -0.6445149 debye
polarizability: 205.8549043|3.2802066|167.275336|9.5098142|4.3996357|121.0864362 unknown
InChI: InChI=1S/C15H22O2/c1-13(2)17-15(16)12-8-4-7-11-14-9-5-3-6-10-14/h3,5-6,9-10,13H,4,7-8,11-12H2,1-2H3
charge 0 multiplicity 1
39 atoms
O  4.033993 0.279825 -0.65804
O  3.65842 -0.903961 1.321055
C  0.424734 -1.185388 0.076995
C  -1.009202 -0.739796 -0.284298
C  1.348755 -1.266261 -1.158238
C  -1.947461 -0.675474 0.953635
C  2.788595 -1.762329 -0.832877
C  -3.360591 -0.241591 0.593125
C  3.526835 -0.797473 0.077915
C  4.738643 1.369263 0.11295
C  -3.730647 1.128311 0.61474
C  -4.330667 -1.193368 0.183421
C  -5.029423 1.537799 0.235847
C  -5.6308 -0.790366 -0.196416
C  5.723771 1.994351 -0.877297
C  3.686616 2.348998 0.652264
C  -5.985192 0.578736 -0.172577
H  0.851654 -0.485783 0.823524
H  0.389839 -2.177307 0.573513
H  -0.982485 0.256974 -0.769586
H  -1.442825 -1.43696 -1.029964
H  0.908795 -1.964294 -1.89792
H  1.411869 -0.276814 -1.651437
H  -1.510098 0.024972 1.692121
H  -1.965566 -1.674454 1.432571
H  2.741396 -2.740347 -0.322997
H  3.356412 -1.873312 -1.773469
H  5.265006 0.880002 0.953828
H  -2.996133 1.877663 0.936721
H  -4.065181 -2.258293 0.168806
H  6.297365 2.798167 -0.381006
H  6.434488 1.239157 -1.254065
H  5.187765 2.429354 -1.739227
H  4.181567 3.170394 1.202309
H  2.997388 1.838861 1.346263
H  3.104727 2.787954 -0.177778
H  -5.29721 2.600444 0.263382
H  -6.367417 -1.541168 -0.50527
H  -6.993836 0.893211 -0.463625
