program: Gaussian 09
title: 000259200
version: EM64L-G09RevD.01
frameworkgroup: C1[X(C14H14ClNO4)]
method: RPBEPBE
basis: SDD
operation: Freq
keyword: #p
keyword: freq=noraman
keyword: PBEPBE/SDD
title: #p freq=noraman PBEPBE/SDD
converged: YES YES NO NO
title: Mulliken charges:
elementType: Cl O O O O N C C C C C C C C C C C C C C H H H H H H H H H H H H H H
charge: -0.041507 -0.279585 -0.259511 -0.215923 -0.215583 0.025368 0.277744 -0.303781 -0.332264 -0.629575 -0.232269 -0.177620 -0.183152 0.534192 -0.342825 -0.367857 -0.381331 0.371670 -0.371393 -0.373610 0.233144 0.220859 0.241280 0.226728 0.283236 0.273141 0.250464 0.264364 0.222336 0.235235 0.233978 0.241787 0.285541 0.286719
chargesum: 0.00000
title: Mulliken charges with hydrogens summed into heavy atoms:
elementType: Cl O O O O N C C C C C C C C C C C C C C
charge: -0.041507 -0.279585 -0.259511 -0.215923 -0.215583 0.025368 0.277744 0.150221 0.135744 -0.073198 0.018195 0.086744 0.039184 0.534192 -0.107591 -0.133878 -0.139544 0.371670 -0.085853 -0.086891
polarizability: 4.52718429e+02 1.55874179e+01 1.18792620e+02 1.86372854e+01 2.60698730e+00 1.64784448e+02
1716.lowfreq: -9.8871 -5.8476 -0.0021 0.0009 0.0012 2.7014 19.6608 23.2441 39.1065
frequency: 19.5158 23.2362 39.0991 43.7826 50.4430 70.7573 87.8013 112.1751 119.0574 146.3913 185.4673 202.5097 224.1441 226.7769 250.4158 302.0253 324.5145 337.4329 358.3257 387.6049 412.6931 468.3242 478.5450 506.1701 515.3529 571.0655 610.2609 626.5692 647.8942 653.7157 664.9857 689.4287 738.2049 755.8291 774.2797 812.8519 839.4528 841.7210 849.7728 855.7504 874.9716 889.7458 910.9314 915.7076 952.5512 972.2817 990.0271 991.6011 994.6924 1000.0397 1015.7685 1073.1371 1095.1425 1096.6823 1110.5108 1138.4842 1161.2912 1178.9140 1181.4717 1200.7765 1214.5702 1223.3453 1236.6530 1244.7976 1261.3157 1282.5532 1295.8227 1312.4637 1320.5065 1327.6791 1330.2710 1358.4259 1403.3461 1425.6446 1426.7496 1467.6309 1476.8050 1482.1513 1580.7351 1602.0459 1620.9056 1648.8445 3003.1268 3007.6257 3071.3809 3092.2373 3092.5755 3101.4829 3114.1987 3117.3455 3123.3209 3139.1174 3152.3052 3161.5955 3182.3151 3184.7363
redmass: 5.5713 8.2137 6.3534 6.6911 4.6427 6.7835 3.6935 5.3522 4.9767 3.3238 6.2277 3.0139 4.0375 2.9865 3.7290 8.5603 5.4097 2.8992 4.0797 5.4366 2.9025 4.8684 4.8539 3.2497 5.8569 4.4873 2.6429 7.0058 5.1980 6.7559 4.4973 6.6799 3.9211 5.2469 7.6163 1.9568 3.8953 1.3376 2.4647 1.8660 2.5601 2.1523 2.1631 2.8421 1.1967 3.1734 1.3410 3.6295 1.3738 3.0265 1.1129 1.5805 3.1219 1.6971 1.3965 2.7099 1.1827 2.1559 1.5430 1.2582 2.1871 2.4328 1.8796 1.8785 1.2439 1.4964 1.3286 1.4231 1.2866 1.8171 1.2579 6.0352 5.1094 1.3125 2.5351 1.0916 1.0935 2.4540 7.2976 5.8814 5.8011 5.8405 1.0682 1.0593 1.0561 1.1033 1.0928 1.0883 1.0929 1.1030 1.0872 1.0903 1.0890 1.1116 1.0947 1.0957
irintensity: 0.3083 1.1307 0.7125 2.1145 1.3968 0.2823 4.3377 2.7335 1.4798 7.8877 4.4854 4.8355 1.2242 5.7338 0.6779 3.9293 7.5065 1.2917 8.0851 1.6295 0.0021 2.2114 15.9225 9.8587 3.3611 18.7170 2.7292 0.2418 14.3863 1.2716 22.7941 63.6657 2.1861 15.3956 20.3478 8.9936 4.7293 1.8701 11.2820 33.1483 42.1070 17.4825 2.8504 72.4062 10.0417 14.1855 8.1895 50.0567 0.0516 0.2796 90.4628 119.4265 22.5185 10.2785 16.8560 36.9181 0.4388 7.4159 294.0350 21.9703 512.1445 183.8543 75.8389 25.6212 19.3613 2.1239 1.3804 2.1041 24.6688 11.6532 0.2322 95.4300 15.8024 22.8607 16.7946 4.5911 0.6015 0.5968 6.7978 259.3050 41.2593 0.8795 43.4675 85.5076 12.4132 21.1000 2.8731 14.7595 11.8787 35.2135 12.6924 10.7984 5.9297 7.3547 0.1968 2.1529
temp: 298.150 k
press: 1.00000 atm
elementType: 17 8 8 8 8 7 6 6 6 6 6 6 6 6 6 6 6 6 6 6 1 1 1 1 1 1 1 1 1 1 1 1 1 1
symmnumber: 1
zpe: 667849.4 jmol-1
zpe.correction: 0.254370 hartree
zpe.thermalcorrener: 0.273377 hartree
zpe.thermalcorrenthalpy: 0.274321 hartree
zpe.thermalcorrgfe: 0.203196 hartree
zpe.sumelectzpe: -1356.001757 hartree
zpe.sumelectthermal: -1355.982750 hartree
zpe.sumelectthermalent: -1355.981806 hartree
zpe.sumelectthermalfe: -1356.052932 hartree
dipole: -7.3864 -3.4584 0.6153
dipole: 8.1791
quadrupole: -169.5485 -123.5927 -117.8448
quadrupole: 16.0463 5.5832 -5.1771
quadrupole: -32.5532 13.4027 19.1505 16.0463 5.5832 -5.1771
hfenergy: -1356.2561273 hartree
pointgroup: C01 [X(C14H14Cl1N1O4)]
dipole: -2.9652012 -1.1380191 -0.5171735 debye
polarizability: 453.0889219|-11.3513156|131.4119451|18.019046|-21.2890216|151.7946307 unknown
InChI: InChI=1S/C14H14ClNO4/c15-11-14(19-9-10-20-14)8-2-1-3-12-4-6-13(7-5-12)16(17)18/h1-8H,9-11H2
charge 0 multiplicity 1
34 atoms
Cl -4.380732 2.332235 1.901595
O  -5.16938 0.024818 -1.449215
O  -4.698826 -0.723133 0.759517
O  6.575883 0.643064 -1.242405
O  6.915662 -0.63365 0.620681
N  6.144232 -0.02518 -0.221499
C  -4.454538 0.38488 -0.166951
C  -5.730719 -1.339958 -1.266302
C  -4.909323 -1.915124 -0.098768
C  -5.178057 1.635829 0.348876
C  -2.992691 0.56316 -0.507572
C  -1.972808 0.032426 0.232061
C  -0.567336 0.192868 -0.097944
C  1.888367 -0.235113 0.399623
C  0.449943 -0.344773 0.656541
C  2.435432 0.48675 -0.706959
C  2.796574 -0.880461 1.293698
C  4.685606 -0.097454 -0.005487
C  3.820343 0.558928 -0.913604
C  4.186243 -0.819068 1.101925
H  -5.597427 -1.882324 -2.216316
H  -6.804822 -1.265769 -1.014281
H  -5.444882 -2.656873 0.511794
H  -3.937697 -2.318809 -0.441841
H  -6.213699 1.38499 0.616858
H  -5.139136 2.436822 -0.402454
H  -2.795601 1.159387 -1.408292
H  -2.230693 -0.54237 1.132544
H  -0.337221 0.778314 -0.999538
H  0.169267 -0.921084 1.550321
H  1.770517 0.997471 -1.410362
H  2.395837 -1.436121 2.149351
H  4.249907 1.107845 -1.755701
H  4.886872 -1.310923 1.781503
