program: Gaussian 09
title: 000259199
version: EM64L-G09RevD.01
frameworkgroup: C1[X(C19H16N2O3)]
method: RPBEPBE
basis: SDD
operation: Freq
keyword: #p
keyword: freq=noraman
keyword: PBEPBE/SDD
title: #p freq=noraman PBEPBE/SDD
converged: YES YES NO NO
title: Mulliken charges:
elementType: O O O N N C C C C C C C C C C C C C C C C C C C H H H H H H H H H H H H H H H H
charge: -0.325974 -0.258702 -0.329658 -0.344125 -0.348131 0.371192 0.395055 0.299633 -0.549516 -0.435450 -0.358716 -0.407481 -0.406670 0.186448 -0.239157 -0.235630 0.284189 0.198574 -0.354368 -0.312837 0.335848 -0.348107 -0.366408 -0.537146 0.283854 0.240339 0.211415 0.246388 0.241451 0.231739 0.230792 0.355706 0.274852 0.213880 0.353539 0.245917 0.256398 0.225959 0.225943 0.248963
chargesum: 0.00000
title: Mulliken charges with hydrogens summed into heavy atoms:
elementType: O O O N N C C C C C C C C C C C C C C C C C C C
charge: -0.325974 -0.258702 -0.329658 0.011581 0.005408 0.371192 0.395055 0.299633 -0.265662 -0.195111 -0.147301 -0.161093 -0.165219 0.186448 -0.007418 -0.004837 0.284189 0.198574 -0.079516 -0.098957 0.335848 -0.102191 -0.110010 0.163719
polarizability: 5.24407082e+02 1.47526835e+01 2.26140601e+02 -4.17131475e-01 -7.46779308e-02 9.26284911e+01
1716.lowfreq: -0.0009 -0.0007 -0.0005 4.2487 6.4524 14.3636 19.3385 24.6942 27.8750
frequency: 15.4087 24.5894 27.8720 33.7350 76.6118 93.8792 102.9343 112.2659 136.8703 158.4243 178.5018 188.1467 210.0223 238.2511 268.3748 288.3618 316.0233 330.7494 340.5243 347.4307 394.7349 412.4953 437.3724 479.8712 495.2534 497.7217 503.2645 513.7925 520.8909 581.3943 593.4085 598.6292 617.1706 630.0296 632.7693 639.2200 680.6921 708.9130 750.0757 751.8649 760.4284 767.6225 786.7550 791.0181 817.9239 822.7451 842.1247 849.4424 882.2895 919.0299 947.9486 952.7015 954.1037 963.2681 979.2584 983.5990 983.7799 996.6979 999.9788 1022.6302 1050.1616 1093.8631 1113.0457 1118.0371 1134.4714 1159.3462 1170.4482 1175.6873 1177.5117 1193.1805 1224.0935 1235.1750 1241.7902 1257.2349 1275.7806 1298.1434 1313.5331 1354.2258 1373.7110 1406.0468 1415.6842 1424.8199 1428.7117 1437.3869 1439.5299 1468.9838 1469.4674 1473.2753 1502.8542 1506.3445 1526.4460 1533.8993 1561.0029 1582.7927 1593.1270 1604.9657 1623.2149 1640.7951 2967.6523 3058.7129 3123.0317 3123.6633 3129.7284 3130.3813 3131.8506 3144.6469 3146.2576 3148.2396 3151.7740 3164.3026 3170.1489 3173.2180 3495.1009 3509.9763
redmass: 4.8630 5.5395 4.8202 6.1765 4.3718 5.3271 6.6796 7.4795 4.8580 5.4771 3.6325 5.7046 2.6416 1.4830 4.5563 4.3492 7.5420 7.8327 5.9624 5.9781 3.1138 2.8948 5.2450 2.6117 4.2639 3.5832 2.8279 6.6090 6.0654 6.8706 1.6306 5.9091 1.2082 7.0552 6.7784 2.1999 3.0346 2.4345 4.1038 6.8573 4.8863 1.5007 6.8223 2.6716 1.2933 1.4586 1.6982 6.5144 1.5569 5.2446 1.3947 1.3823 4.1161 1.4847 1.4457 8.8039 1.3498 1.3560 2.8300 2.3148 3.2216 2.2287 1.2591 1.3698 1.6626 1.3341 1.2894 1.1421 1.2575 1.8648 2.1068 2.2138 3.2498 1.6006 1.7144 1.9424 1.5141 1.9074 4.8625 3.3718 4.3198 2.7263 3.9781 2.9795 1.4689 2.4108 1.0495 1.1013 2.8126 3.9163 5.4018 2.8779 5.9656 7.5514 6.3916 5.5327 6.3578 6.8927 1.0326 1.1042 1.0863 1.0860 1.0893 1.0886 1.1000 1.0940 1.0948 1.0957 1.0878 1.1005 1.0952 1.0960 1.0785 1.0792
irintensity: 0.9157 0.5083 0.0939 1.4193 0.4538 3.5290 0.1553 3.5699 10.4657 0.1314 1.0788 35.3832 1.5279 1.6762 4.2475 0.1862 5.8124 0.2041 0.2979 10.0675 0.0020 0.5105 22.7423 18.0016 11.3342 5.6035 4.9932 0.5340 52.0894 3.1377 0.8049 14.6975 180.5702 7.9666 0.2077 9.4459 34.2177 5.7830 18.2737 4.2347 0.0270 60.4530 13.6325 0.0018 16.1028 63.8589 67.5527 0.5336 11.3571 0.4560 6.1047 0.0460 7.2263 3.5060 15.3348 61.4828 1.2806 0.2080 14.0193 4.1567 2.3731 8.9743 0.1945 25.2025 4.2090 1.4522 13.2012 1.4396 165.7601 108.6125 0.8527 1.4992 197.0787 3.3452 13.7189 11.0964 9.6345 35.5649 3.8734 985.5552 455.3013 31.0330 5.1906 10.0925 55.8999 209.7059 14.4258 12.6431 108.1059 64.9289 124.6017 16.1118 12.9607 28.3385 14.6484 10.4684 219.8604 5.9595 80.5911 43.6396 4.3290 6.8567 17.2474 0.2512 23.6067 3.5297 32.5346 13.2623 3.6353 41.7448 10.4165 7.2747 7.4096 186.7551
temp: 298.150 k
press: 1.00000 atm
elementType: 8 8 8 7 7 6 6 6 6 6 6 6 6 6 6 6 6 6 6 6 6 6 6 6 1 1 1 1 1 1 1 1 1 1 1 1 1 1 1 1
symmnumber: 1
zpe: 809389.5 jmol-1
zpe.correction: 0.308280 hartree
zpe.thermalcorrener: 0.328829 hartree
zpe.thermalcorrenthalpy: 0.329773 hartree
zpe.thermalcorrgfe: 0.256349 hartree
zpe.sumelectzpe: -1067.130345 hartree
zpe.sumelectthermal: -1067.109796 hartree
zpe.sumelectthermalent: -1067.108852 hartree
zpe.sumelectthermalfe: -1067.182276 hartree
dipole: 1.2996 1.1687 0.0196
dipole: 1.7479
quadrupole: -75.3929 -136.7832 -146.9279
quadrupole: 2.3025 -0.0082 -0.1607
quadrupole: 44.3085 -17.0819 -27.2266 2.3025 -0.0082 -0.1607
hfenergy: -1067.438625 hartree
pointgroup: C01 [X(C19H16N2O3)]
dipole: 0.5129019 0.4579632 -0.0106897 debye
polarizability: 524.484148|13.6206247|225.8834196|-3.4685642|-4.6128264|92.8086071 unknown
InChI: InChI=1S/C19H16N2O3/c1-24-17-10-8-14(9-11-17)18(22)20-21-19(23)16-7-6-13-4-2-3-5-15(13)12-16/h2-12,20-21H,1H3
charge 0 multiplicity 1
40 atoms
O  -0.784063 -1.818386 -0.021094
O  7.693646 -0.985285 -0.079614
O  1.957649 2.068051 -0.135111
N  -0.066801 0.359045 -0.084308
N  1.246513 -0.111618 -0.078104
C  -4.890665 -0.618556 -0.01214
C  -5.221995 0.791858 -0.065054
C  -2.488363 -0.058253 -0.06066
C  -3.516228 -1.009229 -0.011629
C  -4.153413 1.748304 -0.115963
C  -2.821483 1.340605 -0.114042
C  -5.95297 -1.581937 0.038621
C  -6.600031 1.184123 -0.065344
C  -1.086163 -0.573079 -0.053995
C  -7.28755 -1.17071 0.037363
C  -7.613388 0.222961 -0.015036
C  3.666314 0.316894 -0.09741
C  2.266248 0.823635 -0.105073
C  4.703895 1.280823 -0.128365
C  4.017521 -1.063178 -0.061103
C  6.390923 -0.480422 -0.087731
C  6.059061 0.89858 -0.123953
C  5.362889 -1.459577 -0.056314
C  8.800742 -0.022538 -0.108671
H  -3.238445 -2.068542 0.027768
H  -4.399669 2.815719 -0.157471
H  -2.039401 2.107191 -0.156116
H  -5.699572 -2.647764 0.078765
H  -6.849604 2.251088 -0.105792
H  -8.092752 -1.912202 0.076494
H  -8.664539 0.531688 -0.015493
H  -0.118916 1.382691 -0.107409
H  4.418564 2.337503 -0.156138
H  3.252976 -1.848298 -0.035548
H  1.300179 -1.134841 -0.052645
H  6.836459 1.667598 -0.14846
H  5.646805 -2.515524 -0.028297
H  8.779819 0.63792 0.779234
H  8.775022 0.589019 -1.030844
H  9.712682 -0.636458 -0.094516
