program: Gaussian 09
title: 000259168
version: EM64L-G09RevD.01
frameworkgroup: C1[X(C16H18N2O2)]
method: RPBEPBE
basis: SDD
operation: Freq
keyword: #p
keyword: freq=noraman
keyword: PBEPBE/SDD
title: #p freq=noraman PBEPBE/SDD
converged: YES YES NO YES
title: Mulliken charges:
elementType: O O N N C C C C C C C C C C C C C C C C H H H H H H H H H H H H H H H H H H
charge: -0.252948 -0.252948 -0.098661 -0.098661 0.254304 0.254303 -0.008727 -0.008727 0.305379 0.305379 -0.465655 -0.465655 -0.456989 -0.456989 -0.390434 -0.390434 -0.284259 -0.284259 -0.612846 -0.612847 0.197689 0.238171 0.197689 0.238171 0.270396 0.270397 0.226568 0.226568 0.198205 0.226669 0.198205 0.226670 0.231685 0.195043 0.226410 0.231685 0.195043 0.226410
chargesum: 0.00000
title: Mulliken charges with hydrogens summed into heavy atoms:
elementType: O O N N C C C C C C C C C C C C C C C C
charge: -0.252948 -0.252948 -0.098661 -0.098661 0.254304 0.254303 -0.008727 -0.008727 0.305379 0.305379 -0.029795 -0.029795 -0.186592 -0.186592 -0.163866 -0.163866 0.140615 0.140616 0.040292 0.040291
polarizability: 3.09662140e+02 -1.21010061e+01 1.97853630e+02 -8.03234028e-04 -2.28453799e-03 1.05089052e+02
1716.lowfreq: -4.8218 -4.4983 -0.0004 -0.0003 0.0007 14.6010 37.8299 68.6546 76.4381
frequency: 37.8125 68.6488 76.4381 113.4348 116.0953 121.7145 147.4595 165.1285 205.9525 214.8484 229.5058 265.8990 271.8604 273.7612 307.8305 328.8779 332.8341 343.0796 410.5791 422.9420 468.5619 481.9384 489.5323 511.3928 528.9156 556.4035 561.0518 596.7423 620.6165 645.2441 689.8921 705.8584 766.8028 808.0759 820.5896 826.6693 831.1983 858.1943 861.8867 941.3427 956.8976 961.4645 962.8941 980.4488 987.2090 991.0435 1019.6348 1032.9814 1036.3542 1063.9438 1071.2045 1113.0285 1114.3123 1138.1804 1164.8393 1166.4898 1166.9017 1181.2547 1190.8188 1191.4446 1222.7634 1234.8029 1237.4313 1265.5139 1271.3685 1284.2051 1284.6962 1329.9842 1338.5011 1369.7512 1378.8173 1381.6479 1393.3157 1422.1157 1433.0244 1434.3388 1434.9258 1459.4753 1461.7555 1463.3211 1463.7885 1476.9578 1478.8581 1481.4375 1489.4024 1490.2791 1511.8499 1582.5280 1609.0770 1640.3744 2818.7004 2818.7377 2845.4692 2845.8032 2871.9384 2872.5136 3007.3914 3007.4460 3020.0471 3020.1134 3078.7321 3078.7391 3091.3018 3091.4248 3118.3041 3118.5813 3177.3653 3177.6235
redmass: 3.9670 3.6961 2.9576 2.3490 3.3718 4.0837 3.1911 4.1073 1.4326 1.1621 3.3781 3.2253 3.2492 3.3368 2.4124 2.2563 3.5722 2.4200 3.3315 4.7635 6.3711 3.4897 5.1029 6.8730 5.9670 5.5376 5.5814 3.6504 5.3974 7.2065 5.0518 4.8761 2.2112 4.4282 1.4352 5.7517 2.2320 4.3928 4.7946 6.0843 1.4048 5.7048 1.3720 2.8966 1.7785 1.8173 2.3724 1.9854 2.0195 1.9269 2.1519 1.3273 1.3174 1.7440 1.8394 1.9367 2.3002 1.5320 1.1043 1.0870 2.1134 1.7240 2.0283 2.9209 4.2335 1.5840 1.6155 1.9029 1.9057 1.9683 1.3199 1.7891 2.8411 3.6760 2.5642 1.1639 1.6925 1.1961 1.0675 1.0730 1.0744 1.7514 1.1225 1.2951 1.0684 1.1201 4.5910 8.4259 6.8946 7.7408 1.0713 1.0713 1.0693 1.0692 1.0573 1.0575 1.0859 1.0858 1.0740 1.0740 1.1006 1.1006 1.0919 1.0918 1.0896 1.0895 1.0945 1.0941
irintensity: 3.7407 3.6369 2.2165 0.4859 0.8091 2.7503 0.0536 0.5336 0.0466 1.2550 1.3833 1.2398 6.7648 2.3522 5.3625 12.5397 4.3778 3.0610 2.2506 1.5361 2.7199 2.1871 12.0141 4.5805 0.0128 3.0783 1.2233 1.6966 5.1692 0.0669 15.5780 4.0543 0.2095 0.7358 82.3824 12.6657 0.9928 48.0685 1.1043 7.8619 10.7047 305.7700 2.7437 0.0168 21.8950 0.4041 143.3033 4.0278 41.5130 0.1085 34.7439 2.1102 7.3937 1.6543 163.3492 1.6948 0.1566 38.3701 9.5584 1.0344 130.9459 1.6426 0.6794 2.1993 11.8555 5.2888 26.0790 76.6498 0.6604 147.2365 0.8516 24.9128 0.0001 128.3062 2.2166 3.7484 3.3752 3.9701 21.7774 20.8049 5.3432 5.5705 12.2104 3.2339 23.1981 1.1492 102.4359 0.4898 19.0860 0.0342 109.1422 36.6094 15.2501 175.3358 335.8802 141.0351 25.8371 21.7118 28.5074 63.9891 4.1803 33.9613 77.3061 1.4174 34.3604 0.0075 11.1047 0.0067
temp: 298.150 k
press: 1.00000 atm
elementType: 8 8 7 7 6 6 6 6 6 6 6 6 6 6 6 6 6 6 6 6 1 1 1 1 1 1 1 1 1 1 1 1 1 1 1 1 1 1
symmnumber: 1
zpe: 812883.4 jmol-1
zpe.correction: 0.309611 hartree
zpe.thermalcorrener: 0.326911 hartree
zpe.thermalcorrenthalpy: 0.327855 hartree
zpe.thermalcorrgfe: 0.265116 hartree
zpe.sumelectzpe: -878.959063 hartree
zpe.sumelectthermal: -878.941763 hartree
zpe.sumelectthermalent: -878.940819 hartree
zpe.sumelectthermalfe: -879.003558 hartree
dipole: 0.0000 0.0000 1.8143
dipole: 1.8143
quadrupole: -74.0143 -111.7928 -123.2506
quadrupole: -4.7864 -0.0002 -0.0003
quadrupole: 29.0049 -8.7735 -20.2314 -4.7864 -0.0002 -0.0003
hfenergy: -879.2686744 hartree
pointgroup: C01 [X(C16H18N2O2)]
dipole: 0.0000049 -0.000017 -0.7137848 debye
polarizability: 309.8330457|11.2825724|197.682724|0.0007865|-0.0022903|105.0890517 unknown
InChI: InChI=1S/C16H18N2O2/c1-17-7-11-3-5-14-13(15(11)19-9-17)6-4-12-8-18(2)10-20-16(12)14/h3-6H,7-10H2,1-2H3
charge 0 multiplicity 1
38 atoms
O  2.665767 -1.503469 -0.141156
O  -2.66576 1.503502 -0.141259
N  4.58756 -0.110804 0.309559
N  -4.587559 0.11086 0.309507
C  0.435238 -0.575739 -0.116417
C  -0.435232 0.575773 -0.11645
C  1.856244 -0.349278 -0.115755
C  -1.856238 0.349312 -0.115793
C  2.400818 0.944178 -0.08988
C  -2.400813 -0.944142 -0.089858
C  3.906273 1.159853 -0.008297
C  -3.906269 -1.159813 -0.00828
C  -0.124523 -1.89384 -0.123352
C  0.124528 1.893874 -0.123447
C  1.509152 2.061467 -0.10794
C  -1.509147 -2.061432 -0.107851
C  4.071459 -1.210413 -0.4919
C  -4.071449 1.210429 -0.492003
C  6.050951 -0.025339 0.402657
C  -6.05095 0.025401 0.402592
H  4.283216 1.610908 -0.965086
H  4.130776 1.886514 0.795883
H  -4.283202 -1.610914 -0.965051
H  -4.130781 -1.886434 0.795933
H  0.550059 -2.753331 -0.129803
H  -0.550054 2.753364 -0.12995
H  1.935957 3.072238 -0.093326
H  -1.935952 -3.072202 -0.09319
H  4.084212 -0.99964 -1.592483
H  4.630806 -2.134245 -0.278661
H  -4.084192 0.9996 -1.592575
H  -4.630798 2.134271 -0.278816
H  6.326182 0.727274 1.163283
H  6.548554 0.263454 -0.556575
H  6.462627 -0.997893 0.726418
H  -6.32619 -0.727176 1.163252
H  -6.548544 -0.263438 -0.55663
H  -6.462629 0.99797 0.726303
