program: Gaussian 09
title: 000259177
version: EM64L-G09RevD.01
frameworkgroup: C1[X(C15H19N3O3)]
method: RPBEPBE
basis: SDD
operation: Freq
keyword: #p
keyword: freq=noraman
keyword: PBEPBE/SDD
title: #p freq=noraman PBEPBE/SDD
converged: YES YES NO NO
title: Mulliken charges:
elementType: O O O N N N C C C C C C C C C C C C C C C H H H H H H H H H H H H H H H H H H H
charge: -0.440385 -0.255846 -0.241374 -0.083204 -0.219423 -0.364960 -0.471349 0.311716 -0.350821 -0.083824 -0.504759 0.355232 -0.620605 0.473159 -0.629465 0.202383 0.236920 -0.872462 -0.830085 -0.271069 -0.146172 0.229572 0.230890 0.278060 0.244583 0.305677 0.223002 0.225414 0.209625 0.233112 0.231958 0.226051 0.248947 0.210631 0.253927 0.226272 0.348561 0.258457 0.366623 0.255029
chargesum: 0.00000
title: Mulliken charges with hydrogens summed into heavy atoms:
elementType: O O O N N N C C C C C C C C C C C C C C C
charge: -0.073761 -0.255846 -0.241374 -0.083204 -0.219423 -0.016399 -0.010888 0.311716 0.171822 -0.083824 -0.199082 0.355232 0.037437 0.473159 -0.396353 0.202383 0.236920 -0.165506 -0.139255 -0.012612 0.108857
polarizability: 2.49806184e+02 4.27106637e+00 2.13159822e+02 -1.53224486e+01 9.03785365e+00 1.16177049e+02
1716.lowfreq: -3.8602 -0.0005 0.0002 0.0006 1.2673 10.7538 22.9324 28.6189 45.5007
frequency: 22.8549 28.5912 45.4831 66.2000 86.4751 90.7766 95.8856 113.5627 144.6260 151.5549 165.6812 172.6843 204.4200 228.3269 236.9039 262.7121 282.4989 295.3633 305.2448 310.4566 341.6570 347.4039 377.6442 390.7517 427.5023 452.4614 465.0948 500.6498 512.8063 522.8372 549.3224 554.4944 569.6075 579.8009 631.1366 641.3219 699.8477 711.8984 731.4361 741.6357 760.4340 798.7611 827.7677 855.7077 871.7578 913.8483 918.6100 926.9962 943.7203 963.2359 987.5236 999.0222 1015.9364 1036.7921 1041.9354 1053.7269 1056.9657 1067.4208 1104.1079 1123.4118 1137.3485 1141.9499 1167.5442 1171.1008 1219.5386 1221.7432 1229.5671 1257.2896 1282.1812 1328.1005 1330.4437 1339.5453 1360.4213 1373.5407 1386.8477 1397.0215 1397.8041 1402.1242 1423.0209 1432.9870 1444.5462 1455.4596 1459.1108 1465.1352 1471.6846 1474.3350 1478.5872 1478.9313 1484.4393 1495.6418 1592.3153 1617.6108 1624.5576 1644.4900 1665.0625 2892.4618 2900.7739 2939.3987 2946.9928 2969.7996 3000.3582 3013.3936 3038.1616 3050.2814 3078.7592 3081.8170 3083.5042 3089.5008 3111.0236 3160.9491 3174.8431 3218.4932 3563.4402 3582.9124
redmass: 4.4451 6.1261 4.7124 5.5828 4.6193 1.0473 3.3995 3.7333 6.8503 1.2219 5.3962 2.7345 2.8834 2.1923 1.4485 2.4841 3.1046 1.3193 2.6019 3.8969 4.0110 3.6306 3.0576 3.0083 3.4006 5.8752 5.6324 3.3765 4.5971 6.9687 5.1058 4.9578 3.3571 4.0369 1.4040 4.0816 2.6421 4.0228 3.9666 6.0815 5.5497 1.8622 5.0380 5.2890 1.3115 2.0362 2.2411 1.6279 1.2846 3.2812 1.9997 1.8822 1.4462 2.0532 1.5054 1.5465 2.7233 2.4373 2.0070 1.9583 3.1136 2.8567 2.0882 1.4688 2.0913 1.6970 1.6213 1.3824 1.4288 1.8786 5.4409 1.7671 1.6125 1.6584 2.7015 1.3148 1.3906 1.3459 2.3969 1.2453 1.7724 1.5536 1.5839 1.0806 1.0774 1.0554 1.0470 1.0694 1.1647 1.4658 6.6496 6.3285 6.5671 7.7672 5.8728 1.0650 1.0576 1.0685 1.0402 1.0384 1.0878 1.0977 1.0781 1.0948 1.0922 1.1001 1.0940 1.1004 1.0914 1.0917 1.0920 1.0982 1.0785 1.0653
irintensity: 1.0328 1.2239 0.4803 8.9274 1.6854 0.3817 2.9442 0.0924 1.4703 0.7724 0.3724 3.4819 2.2594 11.3723 1.5289 0.6921 2.2940 111.9600 9.5348 2.7266 2.0326 3.6832 11.7542 15.4337 5.4360 5.5234 1.8167 2.7480 3.9303 5.1122 3.7400 9.1515 7.8574 14.5793 57.1598 3.1909 28.1304 44.1343 7.4016 14.1850 26.0016 50.3760 19.6849 5.0406 21.0671 20.2478 4.0488 26.8408 0.0290 3.3940 7.3252 24.0985 21.1562 33.9867 3.4031 24.3278 5.1570 29.6199 12.5602 20.1294 73.6139 39.8394 14.6728 116.2204 60.6958 10.3398 5.3765 19.5892 27.3258 79.1232 21.1965 86.4980 4.5716 15.9045 7.1996 12.5756 31.0461 9.0817 2.1340 7.1731 1.8206 77.4965 7.5873 10.5648 6.0394 18.4211 16.7549 26.1748 19.7227 38.6635 242.8703 0.9361 1.1962 462.1541 199.3876 23.2734 103.3829 36.4834 51.8343 42.9550 18.4253 26.4650 35.8411 22.5249 3.1062 16.3239 13.5894 39.9065 25.3978 4.8385 6.2183 3.0071 95.9039 25.5427
temp: 298.150 k
press: 1.00000 atm
elementType: 8 8 8 7 7 7 6 6 6 6 6 6 6 6 6 6 6 6 6 6 6 1 1 1 1 1 1 1 1 1 1 1 1 1 1 1 1 1 1 1
symmnumber: 1
zpe: 843823.0 jmol-1
zpe.correction: 0.321395 hartree
zpe.thermalcorrener: 0.342338 hartree
zpe.thermalcorrenthalpy: 0.343282 hartree
zpe.thermalcorrgfe: 0.270950 hartree
zpe.sumelectzpe: -971.380776 hartree
zpe.sumelectthermal: -971.359833 hartree
zpe.sumelectthermalent: -971.358889 hartree
zpe.sumelectthermalfe: -971.431221 hartree
dipole: -2.8603 0.5906 -0.5882
dipole: 2.9793
quadrupole: -75.7485 -128.5118 -125.5473
quadrupole: -13.3190 -6.2792 -1.7181
quadrupole: 34.1873 -18.5759 -15.6114 -13.3190 -6.2792 -1.7181
hfenergy: -971.7021716 hartree
pointgroup: C01 [X(C15H19N3O3)]
dipole: 1.1257052 0.2596486 0.1982337 debye
polarizability: 248.8230199|-3.1600436|213.2941277|-19.6951547|-7.3701217|117.0259076 unknown
InChI: InChI=1S/C15H19N3O3/c1-10-6-11(2)14(20)12(7-10)8-17(3)9-18-13(19)4-5-16-15(18)21/h4-7,16,20H,8-9H2,1-3H3
charge 0 multiplicity 1
40 atoms
O  -3.246706 -2.4731 0.338943
O  3.645754 -2.025313 0.70863
O  1.244859 1.989135 0.034518
N  0.554466 -1.10203 -0.939023
N  2.406577 -0.046009 0.293397
N  4.78531 -0.033314 0.335799
C  -0.826498 -1.648072 -0.815264
C  -1.870662 -0.62612 -0.382232
C  1.12044 -0.788727 0.391364
C  -3.088398 -1.070855 0.191717
C  -1.682995 0.760632 -0.561728
C  -4.10241 -0.161932 0.593254
C  1.417502 -1.993664 -1.747325
C  -2.665247 1.70352 -0.169359
C  -3.865268 1.221783 0.406094
C  3.59689 -0.788664 0.46401
C  2.352482 1.385152 0.079787
C  -5.396093 -0.671285 1.20754
C  -2.419359 3.189647 -0.368306
C  3.65361 2.042491 -0.055929
C  4.816271 1.329142 0.075808
H  -1.104446 -2.038839 -1.814029
H  -0.869596 -2.526945 -0.128093
H  0.404088 -0.141896 0.922539
H  1.331212 -1.701332 0.992285
H  -0.733868 1.10017 -0.987384
H  0.953027 -2.135068 -2.738874
H  2.404508 -1.52688 -1.903674
H  1.582838 -2.994746 -1.282581
H  -4.637828 1.935427 0.720842
H  -5.964709 -1.322021 0.511823
H  -5.224536 -1.244234 2.14267
H  -6.057183 0.171277 1.469601
H  -3.081153 3.801408 0.270464
H  -1.371105 3.446333 -0.132697
H  -2.600973 3.491412 -1.41865
H  5.642491 -0.5757 0.455822
H  3.656108 3.115175 -0.249184
H  -4.101142 -2.677221 0.793248
H  5.805842 1.785562 -0.008726
