program: Gaussian 09
title: 000259160
version: EM64L-G09RevD.01
frameworkgroup: C1[X(C10H12N2O2)]
method: RPBEPBE
basis: SDD
operation: Freq
keyword: #p
keyword: freq=noraman
keyword: PBEPBE/SDD
title: #p freq=noraman PBEPBE/SDD
converged: YES YES NO NO
title: Mulliken charges:
elementType: O O N N C C C C C C C C C C H H H H H H H H H H H H
charge: -0.266050 -0.225355 -0.126266 -0.015027 0.237738 0.028657 -0.297412 -0.322671 -0.296941 -0.263710 -0.103048 -0.102977 -0.547842 -0.550905 0.242148 0.242132 0.257709 0.237337 0.237316 0.252985 0.247139 0.253910 0.225946 0.216148 0.225388 0.213652
chargesum: 0.00000
title: Mulliken charges with hydrogens summed into heavy atoms:
elementType: O O N N C C C C C C C C C C
charge: -0.266050 -0.225355 -0.126266 -0.015027 0.237738 0.028657 0.186868 -0.064962 0.177712 -0.010725 0.144091 0.150933 -0.105748 -0.111865
polarizability: 1.60854438e+02 1.77966755e+00 1.69467634e+02 1.90762877e-03 -6.82293106e-03 5.89960596e+01
1716.lowfreq: -104.3781 -99.5161 -8.8592 -8.7494 -5.1770 0.0002 0.0005 0.0011 44.8052
frequency: -104.3768 -99.5152 44.7949 46.0307 56.6841 80.7707 121.8959 125.6023 202.2169 226.6604 239.2451 298.6188 334.7299 351.1005 457.1197 483.9343 542.5669 546.5560 548.8720 603.0475 623.7220 675.8695 749.0659 767.9675 823.4176 890.9800 901.8759 920.0946 933.6885 936.9659 951.5477 960.0823 977.2768 978.6636 985.3686 1003.0345 1006.0307 1033.2298 1073.2258 1136.0118 1139.0226 1179.5826 1181.7110 1246.2063 1274.2988 1276.1590 1284.7817 1293.5388 1308.2162 1325.5396 1376.2454 1404.4909 1429.5412 1429.8927 1459.6879 1461.8509 1531.3344 1541.9265 1662.8341 1663.1826 2988.8697 2994.0951 3046.0884 3051.7551 3092.3971 3093.8993 3130.7681 3133.0789 3152.6121 3203.3192 3204.6806 3207.0017
redmass: 1.8802 1.9085 4.3157 2.8830 4.1907 1.9636 4.2088 3.0081 5.6386 11.3520 3.3717 4.6107 4.8319 3.5887 3.5294 3.8599 4.2248 1.3597 1.3665 9.1303 8.9600 5.5452 7.7594 5.6042 1.4909 2.5125 2.1447 7.8010 1.3087 1.3087 3.5711 1.3936 1.2370 1.2165 4.1172 1.4453 1.4278 4.8740 1.5677 2.0839 2.1560 1.0644 1.0636 2.4485 1.3217 1.6769 3.0739 2.1293 1.6098 1.5174 4.1288 2.0810 1.2207 1.2229 1.1215 1.0950 5.5629 7.1393 4.9351 4.9349 1.0567 1.0569 1.1055 1.1057 1.0618 1.0616 1.0941 1.0941 1.0920 1.1136 1.1138 1.0965
irintensity: 1.4978 4.3185 0.6996 0.0485 0.0248 0.2390 1.7748 14.7709 1.5324 4.5996 0.5054 6.1615 2.0370 4.9135 0.0032 4.1423 1.9285 0.9518 34.2308 0.8850 2.9042 2.2812 4.4435 1.4799 60.1289 4.5060 11.7888 8.9188 52.1176 90.9445 2.0451 0.3114 0.5779 44.9907 106.2613 5.9759 19.2623 124.8997 17.9704 3.3876 0.8337 0.0072 1.7323 290.1957 18.4061 4.1374 42.1899 105.9880 144.7615 4.1773 214.4534 237.0452 10.9161 18.7046 22.2941 7.1842 310.2793 253.8615 6.3868 14.7711 11.5675 12.4261 20.5091 20.2956 8.6627 8.2974 3.3870 2.4009 19.7955 24.3220 20.2241 2.0341
temp: 298.150 k
press: 1.00000 atm
elementType: 8 8 7 7 6 6 6 6 6 6 6 6 6 6 1 1 1 1 1 1 1 1 1 1 1 1
symmnumber: 1
zpe: 528792.3 jmol-1
zpe.correction: 0.201406 hartree
zpe.thermalcorrener: 0.214203 hartree
zpe.thermalcorrenthalpy: 0.215148 hartree
zpe.thermalcorrgfe: 0.160228 hartree
zpe.sumelectzpe: -647.099623 hartree
zpe.sumelectthermal: -647.086825 hartree
zpe.sumelectthermalent: -647.085881 hartree
zpe.sumelectthermalfe: -647.140801 hartree
dipole: 2.3574 -2.3564 -0.0003
dipole: 3.3331
quadrupole: -83.4581 -73.8992 -86.1013
quadrupole: 7.2407 0.0048 -0.0028
quadrupole: -2.3053 7.2537 -4.9485 7.2407 0.0048 -0.0028
hfenergy: -647.3010289 hartree
pointgroup: C01 [X(C10H12N2O2)]
dipole: 0.9294661 0.9249832 -0.0125077 debye
dipolederiv: -1.2286046 -0.7344442 0.0116293 -0.752643 -0.991385 0.0098783 0.0118358 0.0098421 -0.3117953 -1.2471593 0.7972944 0.005244 0.7985853 -1.011822 -0.0044182 0.0053919 -0.0046005 -0.3131783 -1.3658671 0.0757681 0.0108162 -0.0000421 -0.4421528 0.0011652 0.0112371 0.0004921 -0.1649015 -0.76863 0.0262394 0.0048703 0.6784698 -0.9050399 -0.0034056 0.0020679 0.0025935 -0.2318047 1.6031552 0.6416836 -0.0158052 0.661605 1.0133856 -0.0096334 -0.0159126 -0.0095283 0.19653 1.738149 -0.8049924 -0.0107126 -0.7904629 1.113143 0.0035213 -0.0107837 0.003709 0.2140919 0.2567713 0.1126105 0.000792 0.5151034 0.8006708 -0.0065377 -0.0009807 -0.002871 0.3859891 -0.507926 -0.1809491 0.0038728 -0.5063094 -0.6102452 0.006548 0.0051854 0.0035279 -0.1729988 0.2512044 -0.10365 0.0018853 -0.5511175 0.8298347 0.0032201 0.0036997 -0.0007862 0.391284 0.864693 0.1056646 -0.0089197 -0.1430997 0.4976129 -0.0010012 -0.0078636 -0.0032899 -0.0529919 0.2773178 0.1348501 -0.0052358 0.0014301 0.0701241 -0.0011156 -0.0047435 -0.0024181 -0.2064918 0.2719638 -0.1369496 -0.0041174 -0.0083401 0.0774154 -0.001266 -0.0048335 0.000058 -0.1988978 -0.0224324 -0.1572498 -0.003289 -0.170365 -0.1163173 0.0004388 -0.0031849 0.0003449 -0.4206603 -0.0187116 0.1557153 -0.0050517 0.1741649 -0.1269726 -0.0032337 -0.0050275 -0.003131 -0.4277512 0.0082176 0.006983 -0.0769895 -0.0940809 -0.0663257 0.0352582 -0.0869709 0.0382241 -0.0333783 0.0113296 0.0068485 0.0761009 -0.0940668 -0.0669834 -0.0332445 0.0869379 -0.0380838 -0.0359644 0.0023879 0.0776008 0.001455 0.0636198 0.0749967 -0.0000746 0.0015248 -0.0002098 0.1956418 0.0072879 -0.0123029 -0.0809025 0.0919049 -0.0711434 -0.0354991 -0.0906644 -0.0407053 -0.0383086 0.0106303 -0.0107205 0.080055 0.0934623 -0.0705605 0.0340718 0.0889358 0.0411829 -0.0424316 0.0945235 -0.0024969 0.0003164 0.0249231 -0.1089319 0.0007685 0.0002237 0.0010284 0.1280254 -0.0030476 0.0365312 0.0016975 0.1015782 0.007668 -0.0002833 0.0014332 0.0003434 0.1847017 0.0016042 -0.0350057 0.0020807 -0.098515 0.0195575 0.0018121 0.0023668 0.0011936 0.1847786 -0.1085773 -0.0623516 0.0032112 -0.0579646 0.0526403 0.0011285 0.0031854 0.0011685 0.1947647 -0.006275 0.1247451 0.0014319 0.0920171 -0.0082961 -0.0001095 0.0015547 -0.0004333 0.1904153 -0.1095775 0.0660099 0.0028287 0.0631933 0.0490596 0.0000681 0.0028328 0.0000408 0.1950967 -0.012427 -0.1274318 0.0027361 -0.0930502 -0.0099326 0.0019438 0.0025522 0.0023079 0.1902355 unknown
polarizability: 160.837622|-1.7646483|169.4735577|-0.9497942|-0.4576717|59.0069525 unknown
InChI: InChI=1S/C10H12N2O2/c1-3-7-13-9-5-6-11-10(12-9)14-8-4-2/h3-6H,1-2,7-8H2
charge 0 multiplicity 1
26 atoms
O  2.365457 -0.416805 -0.011246
O  -2.355945 -0.392491 0.032478
N  0.001117 -0.352381 0.010442
N  -1.281598 -2.430242 0.031096
C  1.153459 -1.07239 0.002846
C  -1.159961 -1.074839 0.024299
C  2.340888 1.072458 -0.017229
C  1.165752 -2.490495 0.008826
C  -2.296946 1.092707 0.025387
C  -0.096298 -3.114883 0.023054
C  3.786628 1.514729 -0.033132
C  -3.734165 1.563225 0.037925
C  4.190595 2.807665 -0.042268
C  -4.115157 2.863232 0.035584
H  1.779372 1.415239 -0.906348
H  1.796747 1.422681 0.879756
H  2.101203 -3.050325 0.002574
H  -1.729196 1.4346 0.911356
H  -1.747349 1.426777 -0.874899
H  -0.181379 -4.206345 0.028423
H  4.52108 0.699251 -0.037068
H  -4.480815 0.759151 0.049554
H  5.253939 3.066828 -0.053692
H  3.480593 3.644309 -0.03865
H  -5.173911 3.140841 0.0452
H  -3.390709 3.687502 0.024029
