program: Gaussian 09
title: 000259178
version: EM64L-G09RevD.01
frameworkgroup: C1[X(C13H14Br2N2O3)]
method: RPBEPBE
basis: SDD
operation: Freq
keyword: #p
keyword: freq=noraman
keyword: PBEPBE/SDD
title: #p freq=noraman PBEPBE/SDD
converged: YES YES NO NO
title: Mulliken charges:
elementType: Br Br O O O N N C C C C C C C C C C C C C H H H H H H H H H H H H H H
charge: 0.024912 -0.007076 -0.216409 -0.222786 -0.407332 -0.167974 -0.078527 -0.416402 -0.509782 -0.514386 0.197996 0.187241 -0.441437 0.355110 -0.633968 0.242693 -0.265869 -0.388023 -0.265210 -0.189139 0.254685 0.255665 0.274144 0.264203 0.264941 0.275498 0.257584 0.242625 0.232065 0.219448 0.261299 0.281564 0.272460 0.360188
chargesum: 0.00000
title: Mulliken charges with hydrogens summed into heavy atoms:
elementType: Br Br O O O N N C C C C C C C C C C C C C
charge: 0.024912 -0.007076 -0.216409 -0.222786 -0.047144 -0.167974 -0.078527 0.093948 0.028564 0.026053 0.197996 0.187241 0.058772 0.355110 0.078844 0.242693 0.015695 -0.388023 -0.265210 0.083320
polarizability: 2.35342212e+02 2.02607168e+01 2.08556319e+02 -2.70902312e+01 4.84291383e+00 1.36323748e+02
1716.lowfreq: -9.8855 -8.2189 -3.4010 0.0005 0.0007 0.0007 8.6621 13.1070 25.2665
frequency: 2.9846 12.4111 25.2254 43.6630 68.2126 74.1235 86.3424 96.1096 100.9918 114.2276 120.5313 127.7593 159.8176 199.7006 212.5999 233.4046 264.8187 280.9407 302.1618 325.6201 336.7964 381.4708 439.4521 453.3762 454.3793 485.4540 533.9866 538.7080 543.3331 553.6460 555.8508 579.6438 616.6130 651.6468 658.3169 701.6658 709.8277 802.4938 821.3185 833.4098 857.2756 858.2096 888.6238 902.6956 970.7199 977.4296 1009.0312 1021.7113 1049.6987 1063.0159 1079.6799 1106.9882 1117.2805 1141.8941 1159.0965 1171.6265 1200.5389 1207.5199 1217.7742 1232.7103 1258.3135 1282.0120 1290.5730 1296.1857 1337.6612 1366.7872 1379.0288 1382.8595 1397.1142 1404.5429 1426.9226 1433.5081 1437.6606 1440.9512 1453.7622 1456.8236 1474.1944 1502.1016 1570.3508 1589.2729 1621.3471 1688.2259 2931.8769 2957.8985 3002.7151 3013.5987 3023.2108 3024.8504 3034.0798 3077.8273 3083.7548 3090.6106 3095.2557 3170.0339 3187.0759 3488.3397
redmass: 8.4119 7.0138 8.1463 4.0689 5.8938 1.6505 1.9333 5.6032 2.9108 5.0279 14.1248 4.3444 4.1126 4.9771 4.0857 8.0427 9.0563 3.9950 6.2132 6.7680 7.4956 3.0353 2.4012 2.7941 1.1480 4.1121 5.2784 4.0574 3.4650 3.2342 4.0678 5.0624 5.8971 6.0488 8.9083 5.3494 5.4579 6.1743 1.7085 4.5376 1.4114 4.0195 1.5760 2.0277 2.6736 3.6765 2.2057 2.6601 2.8795 2.1780 1.9266 2.5528 1.2950 1.2235 2.8560 2.0688 1.5907 1.1136 1.8126 2.0930 1.7064 2.7472 1.5398 2.2425 1.5740 1.9425 4.1912 1.7828 1.6139 1.9170 1.5452 1.1429 1.1024 1.8184 1.1007 1.1511 1.0673 1.0637 7.4856 7.6003 12.0102 11.3667 1.0409 1.0633 1.0960 1.0595 1.0975 1.0595 1.0635 1.1031 1.1039 1.0986 1.1016 1.0911 1.0934 1.0649
irintensity: 0.0628 0.2754 0.4894 0.5527 1.3475 3.0125 0.5203 6.5704 1.9941 1.3865 0.4564 3.1634 8.2587 3.9577 3.6525 1.2218 2.9032 20.0719 8.0285 2.4831 6.4002 10.8861 8.2475 7.2041 114.3354 5.6181 26.6764 0.0073 0.2672 12.5305 5.6574 10.3677 10.9181 25.9551 83.1202 24.4057 8.2085 9.2791 13.9408 6.1444 18.3301 33.6549 12.2316 6.4896 12.1994 37.5101 0.1371 25.8304 50.7943 63.2341 92.1301 105.1022 4.0468 1.1888 100.9401 35.7974 105.3842 0.0584 88.2331 93.0655 67.9504 112.5091 10.8703 124.6252 14.1135 26.0759 57.7635 10.3172 20.2250 32.1071 131.3199 58.3185 2.8471 21.3599 25.2899 24.6961 3.5568 10.9587 25.0602 5.9869 510.9390 21.2358 107.9499 28.5900 44.7242 32.8381 5.6420 12.9808 2.3000 0.0584 1.3379 10.0437 9.0888 0.9929 0.1490 67.9352
temp: 298.150 k
press: 1.00000 atm
elementType: 35 35 8 8 8 7 7 6 6 6 6 6 6 6 6 6 6 6 6 6 1 1 1 1 1 1 1 1 1 1 1 1 1 1
symmnumber: 1
zpe: 660385.8 jmol-1
zpe.correction: 0.251528 hartree
zpe.thermalcorrener: 0.272337 hartree
zpe.thermalcorrenthalpy: 0.273282 hartree
zpe.thermalcorrgfe: 0.195224 hartree
zpe.sumelectzpe: -864.411540 hartree
zpe.sumelectthermal: -864.390730 hartree
zpe.sumelectthermalent: -864.389786 hartree
zpe.sumelectthermalfe: -864.467844 hartree
dipole: -0.0654 -0.2570 0.5113
dipole: 0.5759
quadrupole: -129.7348 -133.1315 -141.2294
quadrupole: 2.8854 8.3779 10.0121
quadrupole: 4.9638 1.5671 -6.5309 2.8854 8.3779 10.0121
hfenergy: -864.6630673 hartree
pointgroup: C01 [X(C13H14Br2N2O3)]
dipole: -0.0235201 -0.0480799 0.2201816 debye
polarizability: 216.9881645|-12.9402412|186.7462154|49.4502802|27.1106092|176.4878992 unknown
InChI: InChI=1S/C13H14Br2N2O3/c1-16(7-17-11(18)2-3-12(17)19)6-8-4-9(14)5-10(15)13(8)20/h4-5,20H,2-3,6-7H2,1H3
charge 0 multiplicity 1
34 atoms
Br 4.90749 -1.210278 1.243076
Br 0.715207 -2.650089 -2.552238
O  -1.846381 -0.681015 2.298655
O  -3.481228 0.606429 -1.899536
O  2.866264 1.163643 1.796378
N  -2.58139 0.246082 0.252721
N  -0.866305 2.032947 -0.033943
C  -2.14203 1.667717 0.517222
C  -2.889256 -2.105096 0.517636
C  -3.448485 -1.67626 -0.861108
C  -2.370944 -0.815553 1.167082
C  -3.202787 -0.164605 -0.947547
C  0.36092 1.763116 0.704578
C  1.163807 0.544024 0.220072
C  -0.768444 2.727224 -1.326398
C  2.427512 0.274492 0.813532
C  0.679455 -0.323769 -0.779062
C  3.163265 -0.860002 0.394359
C  1.43305 -1.448009 -1.170579
C  2.684616 -1.740197 -0.596103
H  -2.137317 1.752977 1.61916
H  -2.935481 2.306526 0.093646
H  -2.052836 -2.820997 0.438609
H  -3.647047 -2.562579 1.176058
H  -4.528443 -1.872439 -0.974742
H  -2.938485 -2.16865 -1.707018
H  0.118989 1.603232 1.773299
H  1.030243 2.647933 0.674316
H  -0.003857 2.259908 -1.978545
H  -0.497529 3.797782 -1.202799
H  -1.732995 2.659778 -1.856456
H  -0.285801 -0.100402 -1.240367
H  3.265945 -2.612375 -0.901986
H  3.74628 0.874806 2.15873
