program: Gaussian 09
title: 000259157
version: EM64L-G09RevD.01
frameworkgroup: C1[X(C10H7ClN2)]
method: RPBEPBE
basis: SDD
operation: Freq
keyword: #p
keyword: freq=noraman
keyword: PBEPBE/SDD
title: #p freq=noraman PBEPBE/SDD
converged: NO YES NO NO
title: Mulliken charges:
elementType: Cl N N C C C C C C C C C C H H H H H H H
charge: -0.023275 0.037309 -0.032910 0.318698 -0.099189 -0.342352 -0.346947 -0.224109 -0.224163 -0.226506 -0.201717 -0.282591 -0.120150 0.276901 0.278127 0.230314 0.231150 0.231652 0.255940 0.263819
chargesum: 0.00000
title: Mulliken charges with hydrogens summed into heavy atoms:
elementType: Cl N N C C C C C C C C C C
charge: -0.023275 0.037309 -0.032910 0.318698 -0.099189 -0.065451 -0.068820 0.006204 0.006987 0.005146 -0.201717 -0.026651 0.143669
polarizability: 2.21793844e+02 5.53031686e+00 1.39483704e+02 5.02861377e-03 1.31791696e-02 4.81747470e+01
1716.lowfreq: -0.0016 0.0002 0.0005 7.3553 13.5414 15.5524 50.6720 91.0033 114.3031
frequency: 50.5872 90.9961 114.3000 159.9023 222.6931 254.7987 326.9490 374.3787 405.8017 418.7271 476.3477 480.0488 614.6235 627.9576 629.7809 682.1654 701.4077 760.2003 777.8514 813.6572 831.7494 867.7709 932.1465 959.1145 967.0025 989.3695 1002.2752 1011.7564 1020.0422 1056.9293 1070.2111 1083.6229 1142.6911 1173.2198 1181.5292 1231.5248 1277.7297 1314.8769 1365.4600 1391.0541 1400.0925 1440.2028 1486.8858 1491.7801 1533.9596 1586.8634 1612.8885 3128.1599 3140.8182 3147.2509 3155.7538 3168.2155 3174.4815 3200.0583
redmass: 4.5096 4.9703 7.3779 8.2532 5.2583 6.6117 8.1179 10.2147 2.8760 3.5083 6.7528 3.7406 6.4890 4.9675 7.7966 8.3134 1.8371 2.2938 7.6016 2.0602 1.7679 1.2440 9.4142 1.4257 1.4200 6.2563 1.3753 1.3290 2.7238 2.1973 2.4245 1.4858 3.0300 1.0570 1.1208 4.9750 2.8320 1.3703 2.7602 6.4330 2.4995 2.3363 3.8221 3.6441 7.2284 6.3422 6.1614 1.0854 1.0895 1.0918 1.0944 1.0950 1.0992 1.0972
irintensity: 0.0626 5.3975 0.9014 0.9475 0.8993 1.2019 2.2287 15.1417 0.0261 3.0245 2.7665 0.1008 0.1977 7.0300 19.1218 35.2423 50.8012 51.5133 53.5178 36.9933 14.3951 0.0179 4.7605 5.1265 0.0303 1.6325 0.0004 0.8295 6.5594 13.3864 35.8402 9.9262 82.7586 0.1297 17.4946 12.1403 1.3947 1.6161 25.2445 85.3992 293.9437 4.0528 157.2277 78.1518 328.2030 0.1051 8.5255 0.0813 15.1366 20.0551 21.6390 8.5544 18.9898 1.1158
temp: 298.150 k
press: 1.00000 atm
elementType: 17 7 7 6 6 6 6 6 6 6 6 6 6 1 1 1 1 1 1 1
symmnumber: 1
zpe: 379937.9 jmol-1
zpe.correction: 0.144711 hartree
zpe.thermalcorrener: 0.154830 hartree
zpe.thermalcorrenthalpy: 0.155774 hartree
zpe.thermalcorrgfe: 0.107783 hartree
zpe.sumelectzpe: -953.930787 hartree
zpe.sumelectthermal: -953.920667 hartree
zpe.sumelectthermalent: -953.919723 hartree
zpe.sumelectthermalfe: -953.967714 hartree
dipole: -0.4159 1.6548 0.0016
dipole: 1.7063
quadrupole: -68.9260 -76.3587 -85.5946
quadrupole: 9.3736 -0.0014 0.0070
quadrupole: 8.0338 0.6011 -8.6348 9.3736 -0.0014 0.0070
hfenergy: -954.0754976 hartree
pointgroup: C01 [X(C10H7Cl1N2)]
dipole: -0.0784097 0.6605898 0.0900482 debye
dipolederiv: -0.58288 0.3841416 0.0673773 0.6047505 -0.6177676 -0.0899947 0.0964371 -0.0825059 -0.105059 -1.6039647 0.3282912 0.0939691 0.3170792 -0.382496 -0.0438469 0.0925373 -0.044076 -0.1411902 -1.0326685 -0.0158632 0.026924 -0.545714 -0.4905509 -0.0198714 -0.0420156 -0.0380894 -0.1976246 -0.6413388 -0.0742562 0.0120797 -0.0796099 -0.0417461 -0.001448 0.0113088 -0.0016187 -0.0104714 1.9350229 0.0821226 -0.0534184 0.1832611 0.3784661 0.0317291 -0.0409102 0.0351862 0.0930154 0.095369 0.1346108 0.0101496 -0.1617447 -0.0040504 0.0213932 -0.0284319 0.0110733 -0.1206908 0.0832182 -0.0993017 -0.0201727 0.1786726 -0.0107765 0.0084177 0.0165611 0.0180675 -0.120335 -0.0896306 -0.1919538 -0.0275665 -0.2658496 -0.0007957 0.0296661 -0.0373762 0.0270668 -0.1507316 -0.2160942 0.1401635 0.0205363 0.2108863 0.1106515 0.0276778 0.0298044 0.0300706 -0.1526046 0.0983846 0.0145721 -0.0063758 0.0066147 0.0355059 0.0231231 -0.0074379 0.0228942 -0.1385089 1.4911629 -0.5883426 -0.1270589 -0.8065111 1.1418516 0.1715441 -0.1555632 0.1641074 0.0737558 0.7071547 -0.1846227 -0.049416 0.1479206 0.4766401 0.0610737 -0.006007 0.072423 -0.0195557 -0.3809468 0.1330526 0.0284692 0.2893537 -0.6566932 -0.0874606 0.0486624 -0.0821173 -0.0775408 0.1431518 -0.0594866 -0.0075242 -0.0382507 0.0012739 -0.0187227 -0.004728 -0.0179515 0.1508924 0.103518 0.0763938 0.011773 0.0763488 0.0326787 -0.0184572 0.0117889 -0.0184283 0.1500286 -0.0231383 0.092444 0.0184588 0.1194395 -0.0341637 -0.0294792 0.0219371 -0.0285673 0.1534343 0.0349334 -0.0647373 -0.0042418 -0.0988233 -0.0863682 -0.0287829 -0.0087397 -0.0299197 0.1548236 -0.135866 -0.032448 0.0059091 -0.0350693 0.0911278 -0.0076252 0.0056654 -0.0077112 0.1570022 0.0354342 -0.0471759 -0.0030337 -0.0904218 -0.0575379 -0.0209854 -0.0087667 -0.0224418 0.1238187 -0.0208219 -0.0276043 0.0031622 -0.0123326 0.1147507 -0.0079506 0.0052739 -0.007462 0.1775413 unknown
polarizability: 221.6386595|-4.3350731|137.8443517|-6.5650483|11.9313211|49.9692835 unknown
InChI: InChI=1S/C10H7ClN2/c11-9-6-7-12-10(13-9)8-4-2-1-3-5-8/h1-7H
charge 0 multiplicity 1
20 atoms
Cl 3.68207 -2.049432 -0.4493
N  1.283788 -0.803944 -0.203437
N  0.934778 1.578224 0.12053
C  -0.997773 0.068966 -0.009648
C  0.465441 0.294966 -0.031537
C  -1.88558 1.16555 0.165852
C  -1.5232 -1.242882 -0.164035
C  -3.27821 0.950077 0.185817
C  -2.91683 -1.452261 -0.143262
C  -3.798542 -0.357941 0.031337
C  2.600666 -0.593141 -0.220619
C  2.286385 1.746345 0.096528
C  3.197518 0.67764 -0.074353
H  -1.460594 2.166797 0.283087
H  -0.824083 -2.073818 -0.297601
H  -3.958945 1.797813 0.321172
H  -3.317451 -2.464925 -0.262563
H  -4.88188 -0.523075 0.047105
H  2.65124 2.771686 0.21813
H  4.2779 0.827857 -0.091402
