program: Gaussian 09
title: 000259171
version: EM64L-G09RevD.01
frameworkgroup: C1[X(C19H15NO3)]
method: RPBEPBE
basis: SDD
operation: Freq
keyword: #p
keyword: freq=noraman
keyword: PBEPBE/SDD
title: #p freq=noraman PBEPBE/SDD
converged: YES YES NO NO
title: Mulliken charges:
elementType: O O O N C C C C C C C C C C C C C C C C C C C H H H H H H H H H H H H H H H
charge: -0.234003 -0.448405 -0.264294 -0.196978 -0.477338 0.157490 0.209535 0.140892 -0.383766 0.429600 0.471951 -0.380237 -0.445909 -0.379229 -0.435811 -0.360734 -0.356859 -0.260052 -0.246151 -0.366172 -0.339549 0.261454 0.101140 0.247340 0.238812 0.239923 0.245960 0.254631 0.243235 0.237261 0.242170 0.236354 0.237815 0.228171 0.230752 0.268332 0.271926 0.380742
chargesum: 0.00000
title: Mulliken charges with hydrogens summed into heavy atoms:
elementType: O O O N C C C C C C C C C C C C C C C C C C C
charge: -0.234003 -0.067663 -0.264294 -0.196978 0.008815 0.157490 0.209535 0.140892 0.102117 0.429600 0.471951 -0.125606 -0.202674 -0.141968 -0.193640 -0.124379 -0.119044 -0.031881 -0.015399 -0.097840 -0.067624 0.261454 0.101140
polarizability: 3.63440036e+02 -1.17929045e+01 2.42122905e+02 -1.53117672e+00 1.65919218e+01 1.21512091e+02
1716.lowfreq: -8.2809 -0.0005 0.0002 0.0003 1.0953 4.7036 8.6239 39.6633 44.8282
frequency: 8.3756 39.6520 44.8229 73.0458 87.1200 118.8338 133.9831 163.4644 177.5031 213.4737 227.3002 245.5590 305.2059 315.5564 368.2956 378.1544 412.3456 414.5498 422.3111 428.5185 479.1288 492.4705 507.0346 518.8118 525.1656 538.9874 557.2981 575.7929 580.7976 630.3299 635.8770 661.2061 669.2333 684.5385 700.7684 745.3381 756.5890 757.1579 782.4157 797.0642 822.9589 825.9713 839.6649 849.0140 870.4540 875.4760 932.4253 952.0316 970.4761 975.7967 976.3342 982.7951 990.1746 991.3541 994.2143 1018.3432 1033.2012 1048.9458 1089.2024 1128.2687 1149.0849 1152.9552 1162.2510 1178.5333 1200.4303 1208.2434 1221.7502 1234.1639 1235.1367 1241.9544 1273.1122 1314.2311 1318.1310 1323.6825 1363.0297 1373.6372 1377.0354 1403.9954 1406.7791 1427.8197 1435.2248 1441.2888 1453.8191 1473.1326 1478.7419 1517.0316 1523.0181 1563.4677 1589.5803 1602.3665 1624.5806 1632.8525 1639.6376 2927.3583 2982.1141 3037.1798 3122.6624 3130.2739 3134.6906 3144.6552 3146.8032 3148.4322 3155.8935 3164.1573 3164.9572 3170.5669 3177.4493 3533.6392
redmass: 5.6861 5.6566 6.6505 5.5062 5.3635 5.1135 5.9063 6.8442 3.3373 4.0235 4.3020 5.6089 4.9549 3.9736 3.9736 5.6055 3.3815 3.0176 5.7679 3.4624 4.6061 3.8868 4.6639 3.3953 3.3504 3.3437 4.8860 5.8795 1.2763 6.8598 5.5836 3.4757 5.6154 3.5633 5.5260 5.2540 2.4656 1.7464 3.1897 5.0398 1.2902 1.4086 2.2536 2.9020 5.9213 1.7134 4.7107 1.3443 1.6783 1.3900 1.8619 1.4563 1.3756 3.7550 2.3294 2.7997 2.2344 2.9706 2.2651 1.5157 1.3285 1.5955 1.5849 1.1426 2.4338 1.2144 1.2875 1.9116 1.7660 1.6756 1.7337 1.3668 1.6407 2.6593 2.3240 1.4190 4.2892 2.2123 3.6356 3.6020 3.7340 4.0318 1.8404 1.3123 1.1293 3.3156 3.5703 7.3146 8.0072 6.0283 6.3381 6.7103 8.2309 1.0695 1.0708 1.0907 1.0861 1.0879 1.0888 1.0874 1.0945 1.0924 1.0916 1.1005 1.0964 1.0963 1.0962 1.0641
irintensity: 0.0376 0.8644 0.6852 0.4286 0.5964 0.7335 2.2808 0.1669 0.8651 6.5429 1.3133 1.0909 0.3235 7.1062 14.0030 7.8008 1.9122 2.5818 26.5657 2.1481 7.0731 10.3100 16.4583 26.2340 11.6870 1.7906 33.3622 6.1228 67.2070 1.9673 14.2809 0.5483 6.7697 70.6963 3.1354 10.8858 51.9583 15.9403 7.2494 32.5615 0.1114 76.2344 30.0264 38.1810 191.9927 22.7151 260.4958 2.5160 15.5848 1.3754 18.5978 31.6651 5.1647 97.0802 10.2856 233.5043 3.7956 31.5136 9.7748 7.7299 1.5764 311.0771 47.5753 4.3113 105.6447 7.5920 30.3315 206.6691 5.8476 47.0118 8.1443 7.1808 42.3477 133.4201 46.6221 65.1051 0.9534 154.6568 3.1009 14.4255 14.7451 8.1037 22.0647 24.7849 18.1022 200.1502 55.0229 9.3796 7.8457 38.7689 547.1585 65.8586 245.2165 41.9577 64.4484 7.2403 4.4128 2.2245 9.1062 7.2949 35.6323 13.7212 7.2899 29.9175 12.6650 8.0304 4.0202 54.6671
temp: 298.150 k
press: 1.00000 atm
elementType: 8 8 8 7 6 6 6 6 6 6 6 6 6 6 6 6 6 6 6 6 6 6 6 1 1 1 1 1 1 1 1 1 1 1 1 1 1 1
symmnumber: 1
zpe: 771727.2 jmol-1
zpe.correction: 0.293935 hartree
zpe.thermalcorrener: 0.312006 hartree
zpe.thermalcorrenthalpy: 0.312950 hartree
zpe.thermalcorrgfe: 0.245782 hartree
zpe.sumelectzpe: -1011.867930 hartree
zpe.sumelectthermal: -1011.849859 hartree
zpe.sumelectthermalent: -1011.848915 hartree
zpe.sumelectthermalfe: -1011.916084 hartree
dipole: -3.4241 -1.0152 1.3699
dipole: 3.8251
quadrupole: -133.0034 -129.2153 -132.4796
quadrupole: -14.7709 1.9721 2.8038
quadrupole: -1.4373 2.3508 -0.9135 -14.7709 1.9721 2.8038
hfenergy: -1012.1618652 hartree
pointgroup: C01 [X(C19H15N1O3)]
dipole: 1.3386974 0.2989777 0.6191044 debye
polarizability: 362.5856902|-14.7988747|245.0032546|6.6985342|-2.3569385|119.4860869 unknown
InChI: InChI=1S/C19H15NO3/c21-19(22)14-5-8-15(9-6-14)20-11-17-16-4-2-1-3-13(16)7-10-18(17)23-12-20/h1-10,21H,11-12H2
charge 0 multiplicity 1
38 atoms
O  0.856309 2.478606 0.517145
O  -6.564687 0.593296 -1.147294
O  -6.306891 -1.706905 -0.943782
N  -0.503016 0.54092 1.070904
C  0.592491 -0.44543 0.94322
C  1.866635 0.224611 0.421396
C  3.02067 -0.577294 0.096038
C  1.913888 1.607287 0.170705
C  -0.045593 1.833085 1.514424
C  4.183469 0.049867 -0.501566
C  -1.801609 0.296368 0.583966
C  3.049248 2.228483 -0.437027
C  4.159119 1.460818 -0.767967
C  3.06232 -1.99303 0.334685
C  5.326917 -0.748719 -0.825361
C  -2.291203 -1.043482 0.483322
C  -2.671904 1.363924 0.200939
C  4.193799 -2.74702 0.008556
C  5.33888 -2.123431 -0.575795
C  -3.589926 -1.298288 0.021278
C  -3.97332 1.099853 -0.250953
C  -4.453295 -0.233396 -0.348791
C  -5.813587 -0.555718 -0.822443
H  0.282776 -1.216406 0.215355
H  0.781597 -0.963471 1.908994
H  -0.869119 2.537445 1.676728
H  0.549235 1.713867 2.442542
H  3.01316 3.307103 -0.615731
H  5.034873 1.929895 -1.230647
H  2.199398 -2.497429 0.782862
H  6.198413 -0.260052 -1.277396
H  -1.666266 -1.883284 0.802145
H  -2.317162 2.398684 0.211541
H  4.205312 -3.825461 0.20175
H  6.218502 -2.72542 -0.827189
H  -3.966381 -2.324431 -0.046479
H  -4.626912 1.92283 -0.553716
H  -7.461841 0.298629 -1.458655
