program: Gaussian 09
title: 000259163
version: EM64L-G09RevD.01
frameworkgroup: C1[X(C16H18N2O2)]
method: RPBEPBE
basis: SDD
operation: Freq
keyword: #p
keyword: freq=noraman
keyword: PBEPBE/SDD
title: #p freq=noraman PBEPBE/SDD
converged: YES YES NO NO
title: Mulliken charges:
elementType: O O N N C C C C C C C C C C C C C C C C H H H H H H H H H H H H H H H H H H
charge: -0.244834 -0.244834 -0.114775 -0.114775 0.121384 0.107699 0.107699 -0.410479 -0.410479 0.452975 0.163834 0.163834 -0.299657 -0.299657 -0.455233 -0.455233 -0.409189 -0.409189 -0.622425 -0.622426 0.187992 0.234869 0.187992 0.234869 0.195139 0.228386 0.195139 0.228386 0.242796 0.242796 0.253753 0.253753 0.230520 0.231452 0.192973 0.231452 0.192973 0.230520
chargesum: 0.00000
title: Mulliken charges with hydrogens summed into heavy atoms:
elementType: O O N N C C C C C C C C C C C C C C C C
charge: -0.244834 -0.244834 -0.114775 -0.114775 0.121384 0.107699 0.107699 0.012382 0.012382 0.452975 0.163834 0.163834 0.123868 0.123868 -0.212436 -0.212437 -0.155436 -0.155437 0.032520 0.032520
polarizability: 2.69943094e+02 -2.38253921e-06 2.22969539e+02 1.37269914e+01 1.38280911e-04 1.06778129e+02
1716.lowfreq: -10.2477 -6.5581 -0.0007 -0.0004 0.0003 5.2408 33.6501 72.7097 81.0180
frequency: 33.6469 72.6908 81.0177 91.1814 106.2450 140.5319 154.4485 179.5885 194.7161 217.4843 221.7659 249.2501 293.2144 298.3637 331.7266 342.0436 351.3299 377.5541 388.5772 403.6933 423.2820 467.1117 469.1178 499.9615 536.9853 560.3139 587.4351 595.9619 657.5615 666.1057 674.1377 719.3298 757.0509 774.5847 794.8477 799.6721 845.3023 864.1284 876.2560 940.5465 950.7937 961.0856 971.8540 972.3325 972.7528 997.0136 1029.8346 1033.4444 1051.0664 1059.8827 1083.8245 1112.0230 1114.9822 1123.1323 1154.7788 1156.8509 1170.7152 1178.7008 1187.6008 1205.9627 1218.1757 1229.3839 1242.8542 1250.1415 1263.3339 1287.7319 1302.7521 1316.3366 1334.9371 1360.9718 1371.5202 1378.7611 1392.1132 1394.2791 1432.9715 1433.4668 1434.4365 1444.3261 1456.8357 1463.5775 1463.6300 1469.3647 1476.7965 1482.0856 1486.7784 1496.3758 1525.5383 1578.1627 1619.6687 1620.5306 2828.0152 2833.5692 2841.9378 2842.6290 2869.2641 2870.5600 3021.7483 3022.2338 3022.2692 3025.9974 3080.5652 3080.6869 3089.5693 3089.7357 3129.9708 3133.1713 3172.9494 3173.5910
redmass: 3.6898 3.9674 2.2844 3.0091 3.3233 3.8794 2.8163 3.0026 2.1294 1.2563 1.5619 3.2605 4.2734 2.3294 2.4697 4.7127 2.8665 2.8366 5.1845 3.8680 4.3386 3.7976 6.6399 4.6099 4.8360 4.2883 6.4737 4.9864 5.3647 3.8558 4.4809 5.0763 7.7035 4.6321 4.1058 1.4239 1.5826 5.1445 4.4939 4.9179 1.3505 3.4026 1.8158 5.6188 1.4505 1.7452 1.9207 2.3618 1.7990 1.8741 2.8943 1.5049 1.3150 1.8033 1.7589 1.6261 1.6849 1.5926 1.1684 1.1710 2.0133 2.3396 3.0315 2.5159 2.9761 1.6552 1.4015 3.0859 1.8710 2.0287 1.3585 1.3643 4.5777 3.7676 1.1526 2.6352 1.1493 2.3733 1.2609 1.0579 1.0642 1.0973 1.1287 1.0839 1.0637 1.0993 4.9622 8.5064 7.1779 6.9004 1.0696 1.0713 1.0687 1.0687 1.0577 1.0579 1.0844 1.0739 1.0737 1.0883 1.1005 1.1004 1.0921 1.0920 1.0897 1.0888 1.0964 1.0963
irintensity: 0.0474 3.4879 0.5203 5.8048 0.3921 0.4602 0.0200 0.0265 2.0248 0.0211 5.1538 2.3303 1.2741 0.1098 19.5074 4.6275 0.1196 10.5850 0.0505 4.8213 0.5221 0.0628 14.1906 0.0322 0.7684 4.1026 3.1001 2.6209 0.8687 0.0935 0.1439 3.9134 43.1223 9.4434 0.2192 0.6583 93.1176 0.3779 54.2477 69.1097 0.1817 4.3201 15.4367 61.7341 5.5796 4.2485 4.4104 65.2174 12.7330 3.4409 1.5063 50.3546 6.1767 48.4746 51.6714 46.2023 67.4076 126.6644 37.5045 2.3116 44.0211 8.6391 61.3409 22.1622 81.9605 4.6514 12.2291 1.0477 9.0876 0.0396 18.7449 35.7710 62.9334 3.3038 14.6755 30.5779 8.9478 33.5010 16.8244 10.4253 26.1130 0.3679 10.5508 14.1964 37.0348 8.4844 70.1843 0.0395 150.9567 19.5839 105.2313 10.4312 206.2526 5.5491 91.0367 311.1295 2.7746 6.6706 74.1547 35.1981 28.7300 0.8647 88.0149 9.6859 0.2771 22.0584 6.9359 11.9516
temp: 298.150 k
press: 1.00000 atm
elementType: 8 8 7 7 6 6 6 6 6 6 6 6 6 6 6 6 6 6 6 6 1 1 1 1 1 1 1 1 1 1 1 1 1 1 1 1 1 1
symmnumber: 1
zpe: 812765.0 jmol-1
zpe.correction: 0.309566 hartree
zpe.thermalcorrener: 0.326824 hartree
zpe.thermalcorrenthalpy: 0.327768 hartree
zpe.thermalcorrgfe: 0.265014 hartree
zpe.sumelectzpe: -878.948479 hartree
zpe.sumelectthermal: -878.931221 hartree
zpe.sumelectthermalent: -878.930277 hartree
zpe.sumelectthermalfe: -878.993031 hartree
dipole: 0.0000 -4.5699 0.0000
dipole: 4.5699
quadrupole: -117.8452 -98.8521 -122.7163
quadrupole: 0.0000 4.5058 0.0001
quadrupole: -4.7073 14.2858 -9.5785 0.0000 4.5058 0.0001
hfenergy: -879.2580452 hartree
pointgroup: C01 [X(C16H18N2O2)]
dipole: -0.0000174 1.7979337 -0.0000297 debye
polarizability: 269.408772|0.0002088|222.9695394|-16.5929927|-0.0018032|107.3124506 unknown
InChI: InChI=1S/C16H18N2O2/c1-17-7-12-14(19-9-17)5-3-11-4-6-15-13(16(11)12)8-18(2)10-20-15/h3-6H,7-10H2,1-2H3
charge 0 multiplicity 1
38 atoms
O  3.741431 -0.264258 -0.420172
O  -3.741294 -0.264311 0.420259
N  2.890734 1.780872 0.475407
N  -2.890624 1.780806 -0.475374
C  0.000074 -0.705876 0.000068
C  1.289202 -0.032888 -0.074727
C  -1.289065 -0.032908 0.074836
C  1.473972 1.464303 0.206761
C  -1.473859 1.464271 -0.2067
C  0.000086 -2.163788 0.000084
C  2.451194 -0.810228 -0.273493
C  -2.451046 -0.810263 0.273612
C  3.756866 1.202717 -0.536422
C  -3.756757 1.202667 0.536463
C  1.222462 -2.892497 -0.158048
C  -1.222278 -2.892514 0.158228
C  2.431187 -2.23512 -0.320555
C  -2.431015 -2.235153 0.320712
C  3.147286 3.190194 0.803057
C  -3.147196 3.190115 -0.803065
H  1.08437 2.094395 -0.633765
H  0.898967 1.734412 1.110649
H  -1.084281 2.094396 0.633811
H  -0.898847 1.734363 -1.110589
H  3.441353 1.448333 -1.583795
H  4.802292 1.50833 -0.376824
H  -3.441261 1.448321 1.583832
H  -4.802187 1.508256 0.376844
H  1.183414 -3.98774 -0.155804
H  -1.183212 -3.987756 0.156007
H  3.378073 -2.763299 -0.461202
H  -3.377893 -2.763345 0.461363
H  4.214506 3.32599 1.052572
H  2.554972 3.475037 1.690969
H  2.888222 3.900395 -0.021777
H  -2.554875 3.474945 -1.690977
H  -2.888155 3.900342 0.021753
H  -4.214415 3.325886 -1.052598
