program: Gaussian 09
title: 000259175
version: EM64L-G09RevD.01
frameworkgroup: C1[X(C14H17Br2NO)]
method: RPBEPBE
basis: SDD
operation: Freq
keyword: #p
keyword: freq=noraman
keyword: PBEPBE/SDD
title: #p freq=noraman PBEPBE/SDD
converged: NO YES NO NO
title: Mulliken charges:
elementType: Br Br O N C C C C C C C C C C C C C C H H H H H H H H H H H H H H H H H
charge: 0.032820 0.003376 -0.252771 -0.082377 -0.007607 -0.449320 -0.398930 -0.399988 -0.406037 -0.391456 -0.539300 -0.397827 0.332328 0.368889 -0.337406 -0.417158 -0.234468 -0.166926 0.202781 0.193342 0.217694 0.215009 0.223523 0.203686 0.194427 0.189365 0.206379 0.202447 0.196615 0.236458 0.251721 0.244375 0.243724 0.251475 0.271139
chargesum: 0.00000
title: Mulliken charges with hydrogens summed into heavy atoms:
elementType: Br Br O N C C C C C C C C C C C C C C
charge: 0.032820 0.003376 -0.252771 -0.082377 0.195173 -0.038283 0.039602 -0.001875 -0.010294 0.007606 -0.051121 0.090272 0.332328 0.368889 -0.085931 -0.417158 -0.234468 0.104213
polarizability: 2.38856270e+02 -1.80552973e+01 2.00787380e+02 -2.20131091e+01 -8.70230186e+00 1.33104011e+02
1716.lowfreq: -19.5305 -6.1437 -0.0004 -0.0002 -0.0001 5.2793 12.5222 31.8342 33.8699
frequency: -11.4584 31.6467 33.7961 111.1022 112.6320 118.6820 136.1963 157.0670 180.3479 202.7378 222.8932 243.3247 290.9277 307.5755 324.2368 339.9306 354.5351 414.8788 420.2731 439.3005 474.1673 493.8841 498.0661 526.2627 546.9982 560.9471 607.5337 684.1870 717.0837 727.0353 777.2643 787.5031 805.9469 836.3931 862.5638 868.8786 871.5367 886.1772 893.0875 900.7895 918.1004 968.4224 987.6157 1021.8208 1045.3797 1055.1215 1074.2123 1084.7283 1107.6686 1109.8851 1138.4541 1145.6693 1180.9616 1194.5677 1209.7133 1219.0889 1229.3762 1252.9612 1258.1940 1263.2887 1295.9233 1306.9159 1325.7235 1329.6973 1335.6316 1339.4302 1342.2144 1348.3323 1355.1748 1360.1410 1384.2816 1394.9244 1429.9238 1451.7122 1459.5166 1463.1915 1464.6031 1465.9646 1473.0094 1480.2634 1549.6471 1587.5531 2951.0836 2954.5180 2963.7104 2969.2622 2971.2421 2971.5180 2981.1419 3016.0165 3030.0848 3033.2608 3038.5218 3041.6358 3049.2491 3051.6182 3144.9139 3154.1465 3181.8376
redmass: 3.9616 3.6581 6.7698 6.9582 7.8330 5.2393 7.8415 4.1136 4.2896 3.3030 2.3962 3.7142 3.1220 7.9023 2.8269 4.1764 2.5201 2.9268 3.0908 2.8802 4.4861 1.9083 4.8330 3.0425 3.8753 4.2215 7.0040 5.2937 9.1163 6.0036 1.9630 1.6083 7.8623 2.7406 1.8341 1.9769 1.4493 1.8179 1.9796 2.2075 1.9334 1.8962 2.5249 2.4768 1.8426 1.1369 1.4447 2.1572 2.5337 2.4799 2.0327 2.7107 2.0357 1.6567 1.3022 1.5935 1.6894 1.2815 1.4153 1.4051 1.3536 1.2913 1.4190 1.3706 1.3878 1.4635 1.5060 1.2608 1.9266 3.5965 1.9784 2.5945 2.5867 1.1501 1.1070 1.1202 1.0913 1.0946 1.0842 1.0957 7.9557 8.0534 1.0820 1.0681 1.0646 1.0658 1.0616 1.0605 1.0614 1.0680 1.0965 1.0956 1.1002 1.1034 1.0997 1.0979 1.0923 1.1006 1.0932
irintensity: 0.0102 0.0128 0.1734 1.8820 0.1177 0.1660 2.2825 4.1768 1.0489 1.7311 1.5564 1.2049 0.2731 0.8700 4.4600 3.7046 2.4240 3.9973 2.4066 5.6612 2.3364 5.0125 2.2115 4.1165 3.4786 8.7436 74.7569 24.7952 173.9151 32.3074 6.5524 1.1118 104.9642 5.2107 18.1980 14.6935 1.1953 8.5115 5.0258 5.6264 0.6116 9.4264 18.7962 22.4602 1.4405 1.7569 10.9285 11.0167 15.5069 6.7580 177.2856 42.3597 5.5972 2.0546 40.8827 23.3883 18.5507 5.8724 3.8064 4.9459 3.5984 0.6312 0.5555 3.7717 0.8378 0.3902 15.0644 3.4625 31.7952 11.6747 34.7645 4.7912 184.7108 54.2160 13.1895 6.0114 4.9502 11.6509 20.3323 1.6049 39.0489 1.7900 8.8464 39.3559 35.0760 34.4671 29.6791 34.1832 34.3834 55.8627 71.2205 69.8191 14.6717 9.1203 39.2955 72.0078 2.9945 12.2216 0.0389
temp: 298.150 k
press: 1.00000 atm
elementType: 35 35 8 7 6 6 6 6 6 6 6 6 6 6 6 6 6 6 1 1 1 1 1 1 1 1 1 1 1 1 1 1 1 1 1
symmnumber: 1
zpe: 739777.6 jmol-1
zpe.correction: 0.281766 hartree
zpe.thermalcorrener: 0.297836 hartree
zpe.thermalcorrenthalpy: 0.298781 hartree
zpe.thermalcorrgfe: 0.236475 hartree
zpe.sumelectzpe: -699.218842 hartree
zpe.sumelectthermal: -699.202772 hartree
zpe.sumelectthermalent: -699.201828 hartree
zpe.sumelectthermalfe: -699.264133 hartree
dipole: -3.7499 -2.2565 1.0087
dipole: 4.4912
quadrupole: -123.0374 -127.0517 -124.1582
quadrupole: 3.2186 -0.8522 -1.7799
quadrupole: 1.7117 -2.3026 0.5909 3.2186 -0.8522 -1.7799
hfenergy: -699.5006082 hartree
pointgroup: C01 [X(C14H17Br2N1O1)]
dipole: 1.4687298 0.0674308 0.9800694 debye
polarizability: 216.1652325|-44.379514|188.2541103|20.8369772|27.823432|168.3283185 unknown
InChI: InChI=1S/C14H17Br2NO/c15-11-6-10-8-17(12-4-2-1-3-5-12)9-18-14(10)13(16)7-11/h6-7,12H,1-5,8-9H2
charge 0 multiplicity 1
35 atoms
Br -2.257379 -1.621866 -2.748907
Br -4.232089 3.078067 0.035957
O  -0.231782 -1.61235 -0.441246
N  1.17771 -0.660306 1.383549
C  2.38491 -0.00561 0.785863
C  3.571991 -0.990955 0.682716
C  2.145417 0.699837 -0.579754
C  4.855178 -0.255881 0.221877
C  3.426455 1.431033 -1.051036
C  4.634406 0.468152 -1.127781
C  0.085175 0.233895 1.839203
C  0.651137 -1.852257 0.817814
C  -1.017701 0.393209 0.786803
C  -1.110151 -0.542399 -0.289796
C  -1.945688 1.454163 0.875904
C  -2.131354 -0.364475 -1.261363
C  -2.950705 1.593824 -0.098056
C  -3.056075 0.694489 -1.179101
H  2.679305 0.775843 1.519931
H  3.345147 -1.787141 -0.055667
H  3.729275 -1.481443 1.662096
H  1.309118 1.420415 -0.497302
H  1.846257 -0.057077 -1.331314
H  5.689223 -0.978793 0.13957
H  5.14993 0.486163 0.992715
H  3.661042 2.25502 -0.344599
H  3.246114 1.901398 -2.036597
H  5.548357 1.020969 -1.418321
H  4.449083 -0.286022 -1.920218
H  0.512509 1.219423 2.095238
H  -0.350112 -0.179702 2.772919
H  1.420818 -2.534848 0.43932
H  -0.025171 -2.361769 1.528475
H  -1.872618 2.170635 1.701071
H  -3.834731 0.807857 -1.936765
