program: Gaussian 09
title: 000259159
version: EM64L-G09RevD.01
frameworkgroup: C1[X(C13H12N2O)]
method: RPBEPBE
basis: SDD
operation: Freq
keyword: #p
keyword: freq=noraman
keyword: PBEPBE/SDD
title: #p freq=noraman PBEPBE/SDD
converged: YES YES NO NO
title: Mulliken charges:
elementType: O N N C C C C C C C C C C C C C H H H H H H H H H H H H
charge: -0.263036 -0.084051 -0.052110 0.315609 -0.093524 -0.343919 -0.350183 0.187691 -0.226364 -0.226174 -0.230882 -0.312536 -0.275320 -0.300935 -0.103749 -0.548729 0.278593 0.263913 0.227913 0.226228 0.228984 0.256385 0.250783 0.244192 0.244267 0.245540 0.224595 0.216817
chargesum: 0.00000
title: Mulliken charges with hydrogens summed into heavy atoms:
elementType: O N N C C C C C C C C C C C C C
charge: -0.263036 -0.084051 -0.052110 0.315609 -0.093524 -0.065327 -0.086269 0.187691 0.001549 0.000054 -0.001898 -0.056150 -0.024536 0.187524 0.141791 -0.107316
polarizability: 2.34641039e+02 1.18758741e+01 1.92513330e+02 9.11652662e-02 -5.60172386e-02 6.39874439e+01
1716.lowfreq: -97.9521 -5.3702 -4.9326 0.0008 0.0009 0.0010 4.8307 34.2257 58.9775
frequency: -97.9487 34.1389 58.9566 62.5503 83.5596 119.1663 151.6890 210.5458 233.9373 252.8631 324.3935 336.3034 406.1053 421.2853 430.1594 492.7980 523.8163 548.6115 606.7856 618.6073 634.7424 665.0782 703.4540 724.2444 760.1845 811.6800 837.1362 866.3215 875.9036 909.1924 935.9981 936.5514 955.2609 968.6324 978.5473 984.2159 990.2102 999.2885 1003.9245 1009.6224 1022.4909 1056.0251 1078.8964 1099.1436 1138.2426 1171.4091 1178.3332 1184.0261 1245.0485 1270.5764 1271.8159 1283.2714 1312.0586 1327.6584 1375.2073 1389.1918 1404.8207 1430.0713 1440.5496 1461.3981 1488.0906 1524.6396 1537.8615 1588.7142 1612.8452 1662.9755 2993.5446 3050.6849 3095.2922 3126.0629 3130.5629 3138.5416 3144.0075 3154.5778 3167.5346 3174.0832 3197.8285 3205.5968
redmass: 1.8798 3.8232 3.1920 4.5267 4.1982 2.9795 4.4729 5.5488 6.6516 3.9519 6.3953 4.4323 2.8793 3.4966 4.8343 3.3707 4.2206 1.3674 7.9363 7.0850 7.5770 4.4457 1.7368 7.1894 2.4349 2.4940 1.7071 1.2446 4.4389 2.6124 1.3118 9.0588 1.4340 1.4013 1.2183 4.1221 6.2702 1.3677 1.4499 1.3300 2.2936 1.8227 1.4832 2.5256 2.1027 1.0566 1.1288 1.0644 3.6868 2.7315 1.9338 1.6490 1.3966 1.4965 4.3948 6.0198 2.4552 1.2261 2.2865 1.1075 2.7805 6.3107 5.8403 6.4721 6.2001 4.9205 1.0570 1.1055 1.0613 1.0851 1.0941 1.0895 1.0916 1.0945 1.0947 1.0987 1.0966 1.1140
irintensity: 2.4040 0.0674 0.0064 0.2568 0.3311 7.6260 1.9567 8.4760 0.1337 2.2845 1.1202 0.7805 0.0231 2.0331 8.0777 1.9363 0.0833 15.9676 0.6474 0.0195 11.9357 4.4479 55.6875 4.3420 41.3720 31.3643 32.6572 0.0304 13.7116 16.6410 68.2547 2.7252 6.0961 0.0300 24.0770 100.2558 2.4181 0.5444 12.4268 1.3435 13.1590 5.0274 6.7142 15.6951 0.6087 0.1196 26.8483 0.8474 116.4345 54.2733 61.9770 100.0215 15.1406 2.0168 50.4611 78.4193 294.9274 14.6201 6.3808 22.8990 8.4914 211.0896 278.8963 1.2238 4.0946 11.6484 9.2653 18.0908 7.8718 0.0068 4.1329 15.7678 26.5765 26.4989 11.9884 17.7230 3.1208 23.2952
temp: 298.150 k
press: 1.00000 atm
elementType: 8 7 7 6 6 6 6 6 6 6 6 6 6 6 6 6 1 1 1 1 1 1 1 1 1 1 1 1
symmnumber: 1
zpe: 571815.8 jmol-1
zpe.correction: 0.217793 hartree
zpe.thermalcorrener: 0.230960 hartree
zpe.thermalcorrenthalpy: 0.231904 hartree
zpe.thermalcorrgfe: 0.176423 hartree
zpe.sumelectzpe: -686.150990 hartree
zpe.sumelectthermal: -686.137823 hartree
zpe.sumelectthermalent: -686.136879 hartree
zpe.sumelectthermalfe: -686.192360 hartree
dipole: 1.0054 -0.8209 0.0007
dipole: 1.2980
quadrupole: -83.5845 -80.6649 -98.9601
quadrupole: 2.4606 -0.0065 -0.0034
quadrupole: 4.1520 7.0716 -11.2236 2.4606 -0.0065 -0.0034
hfenergy: -686.3687831 hartree
pointgroup: C01 [X(C13H12N2O1)]
dipole: -0.3857887 -0.333335 -0.0289341 debye
polarizability: 235.2854137|-10.7213631|191.1712483|1.1662533|9.2690819|64.6851511 unknown
InChI: InChI=1S/C13H12N2O/c1-2-10-16-12-8-9-14-13(15-12)11-6-4-3-5-7-11/h2-9H,1,10H2
charge 0 multiplicity 1
28 atoms
O  -2.920167 0.496787 0.020026
N  -0.568868 0.241814 0.03164
N  0.866306 2.197006 0.20304
C  1.865685 -0.033609 0.04452
C  0.668992 0.844492 0.096747
C  3.167226 0.533456 0.105349
C  1.723891 -1.442784 -0.066362
C  -1.65546 1.046394 0.077892
C  4.305662 -0.296555 0.056065
C  2.864877 -2.269695 -0.115652
C  4.159513 -1.700311 -0.054756
C  -1.560801 2.460017 0.187081
C  -0.256682 2.979259 0.245964
C  -3.012389 -0.986136 -0.087418
C  -4.487971 -1.313336 -0.118131
C  -4.99215 -2.568073 -0.200669
H  3.255356 1.620508 0.190562
H  0.715491 -1.864567 -0.111797
H  5.306145 0.147512 0.103662
H  2.748546 -3.355901 -0.201075
H  5.045492 -2.344285 -0.093134
H  -2.451756 3.088733 0.222379
H  -0.087018 4.057873 0.330958
H  -2.482822 -1.309458 -1.003127
H  -2.491013 -1.437663 0.777217
H  -5.157295 -0.444882 -0.068038
H  -6.07261 -2.741944 -0.219634
H  -4.349485 -3.45585 -0.251704
