program: Gaussian 09
title: 000259170
version: EM64L-G09RevD.01
frameworkgroup: C1[X(C17H17NO3)]
method: RPBEPBE
basis: SDD
operation: Freq
keyword: #p
keyword: freq=noraman
keyword: PBEPBE/SDD
title: #p freq=noraman PBEPBE/SDD
converged: YES YES NO NO
title: Mulliken charges:
elementType: O O O N C C C C C C C C C C C C C C C C C H H H H H H H H H H H H H H H H H
charge: -0.239406 -0.448369 -0.264802 -0.189821 -0.501820 0.337370 0.002795 -0.397333 0.358983 0.479727 -0.605759 0.480161 -0.551274 -0.799245 -0.369646 -0.350876 -0.816980 -0.361922 -0.341208 0.260811 0.100721 0.243870 0.239574 0.239830 0.246246 0.233407 0.239061 0.214748 0.241461 0.238002 0.233869 0.246713 0.230984 0.228052 0.222520 0.267997 0.271219 0.380338
chargesum: 0.00000
title: Mulliken charges with hydrogens summed into heavy atoms:
elementType: O O O N C C C C C C C C C C C C C C C C C
charge: -0.239406 -0.068031 -0.264802 -0.189821 -0.018376 0.337370 0.002795 0.088743 0.358983 0.479727 -0.372352 0.480161 -0.312213 -0.105034 -0.135778 -0.104162 -0.135425 -0.093925 -0.069990 0.260811 0.100721
polarizability: 3.20658460e+02 -1.93796770e+00 2.01885777e+02 9.33286765e+00 -7.75878683e+00 1.27544793e+02
1716.lowfreq: -6.3824 -4.7187 -0.0006 -0.0006 0.0004 3.6411 6.7432 42.7811 46.1073
frequency: -2.3756 42.7777 46.1026 65.3321 72.7153 87.8942 105.5326 135.6316 145.9773 178.4942 191.5184 215.1873 231.2939 237.0636 271.2854 313.5342 345.3445 379.1984 390.5543 415.2442 430.5478 452.4908 486.1036 489.7160 500.8302 514.2138 551.9642 556.6902 567.6000 582.4390 589.6054 630.9906 642.5960 684.9310 700.2255 732.2880 737.9064 756.8892 793.9508 826.6326 845.4120 860.5802 888.0118 893.5882 939.9596 951.4421 976.5820 976.8747 983.9070 991.4027 992.6405 1017.9194 1018.5394 1027.8407 1044.5605 1050.8849 1093.9526 1120.1209 1134.8465 1153.4576 1184.2228 1205.8877 1212.5055 1222.6745 1234.0716 1253.2050 1310.9878 1314.8190 1316.8745 1323.8988 1371.2703 1376.2299 1382.0077 1398.4866 1401.0615 1402.5018 1418.3080 1439.7067 1453.4254 1457.6541 1466.5519 1470.6260 1481.0056 1485.4861 1491.1023 1518.3535 1563.3352 1604.6528 1621.7644 1625.6046 1639.4299 2947.5110 2974.1812 2983.1056 2988.3733 3051.5182 3060.8492 3061.8138 3081.0949 3092.4885 3107.1775 3117.7783 3142.6301 3144.7206 3154.2702 3163.6099 3177.1285 3533.9692
redmass: 5.3948 4.6944 5.0659 1.0760 4.6208 4.9641 1.0753 4.5136 5.2690 4.2579 2.9119 2.9219 4.4369 4.1009 3.0330 5.3247 3.4739 4.8001 4.3401 3.0166 4.7468 3.2380 5.6710 3.4089 3.1484 3.4683 4.3217 4.3650 3.2882 1.2473 4.9015 6.9856 4.7402 3.5852 4.8733 4.8482 4.2980 4.6759 5.1057 1.2721 1.7742 1.3390 7.2807 1.3250 3.6005 2.4332 2.3486 1.3853 1.4521 2.5415 3.5595 2.2124 1.7468 2.0393 1.5113 1.5636 2.1631 2.7988 1.7511 1.5962 1.8048 1.4290 1.6209 1.2360 1.3510 1.4355 2.3316 1.3736 2.5295 2.5658 1.5214 3.4269 4.2691 1.2433 1.3359 2.1781 2.6745 3.8347 1.9846 1.0596 1.1216 1.0462 1.1419 1.1516 1.4201 3.0769 7.3125 7.3226 6.1321 6.3076 8.2123 1.0698 1.0372 1.0367 1.0702 1.0977 1.0968 1.0912 1.0987 1.1002 1.0912 1.0916 1.0876 1.0959 1.0885 1.0965 1.0964 1.0641
irintensity: 0.0814 0.8755 0.6707 0.2917 0.4415 0.5384 0.1333 6.6818 0.3566 1.7118 3.7180 0.0157 0.1036 1.7892 1.2683 1.7306 6.3433 1.6417 26.1002 2.1673 12.9477 1.5616 11.4765 1.8154 15.8232 32.3826 11.6567 32.3106 3.6529 71.9935 3.4041 1.7175 6.9461 69.7434 7.5036 6.3843 19.8236 17.1396 27.2862 0.7488 35.7711 24.3282 399.1545 2.4318 8.0227 42.8128 53.2726 2.9457 34.8537 97.1494 21.4135 141.5183 75.7017 3.2549 0.4239 18.1012 5.0074 96.5434 57.3866 243.7689 41.6852 11.2972 41.1773 29.6353 169.3597 4.4343 5.4628 1.2632 66.5748 112.2041 103.8987 2.7918 3.0928 16.8732 31.5781 99.8983 2.1462 25.2335 39.2177 18.6821 33.0851 11.5379 11.3462 5.0260 99.3226 184.6596 12.0275 11.7691 85.1926 459.0509 261.8797 46.2117 49.2681 27.9539 64.8336 21.2366 16.1350 7.4709 17.3519 21.8129 19.1782 21.2247 5.7414 13.2755 6.3754 10.0568 4.0966 52.5408
temp: 298.150 k
press: 1.00000 atm
elementType: 8 8 8 7 6 6 6 6 6 6 6 6 6 6 6 6 6 6 6 6 6 1 1 1 1 1 1 1 1 1 1 1 1 1 1 1 1 1
symmnumber: 1
zpe: 792476.6 jmol-1
zpe.correction: 0.301838 hartree
zpe.thermalcorrener: 0.319977 hartree
zpe.thermalcorrenthalpy: 0.320921 hartree
zpe.thermalcorrgfe: 0.255373 hartree
zpe.sumelectzpe: -936.940445 hartree
zpe.sumelectthermal: -936.922306 hartree
zpe.sumelectthermalent: -936.921362 hartree
zpe.sumelectthermalfe: -936.986910 hartree
dipole: 3.8498 0.3995 1.3689
dipole: 4.1054
quadrupole: -128.7182 -117.1771 -120.6042
quadrupole: -13.7175 -1.1517 -2.8227
quadrupole: -6.5517 4.9894 1.5623 -13.7175 -1.1517 -2.8227
hfenergy: -937.242283 hartree
pointgroup: C01 [X(C17H17N1O3)]
dipole: 1.4805112 0.0943489 0.638787 debye
polarizability: 318.4533183|-5.5160793|202.5187714|21.3499511|-6.3029688|129.1169396 unknown
InChI: InChI=1S/C17H17NO3/c1-11-7-12(2)16-14(8-11)9-18(10-21-16)15-5-3-13(4-6-15)17(19)20/h3-8,19H,9-10H2,1-2H3
charge 0 multiplicity 1
38 atoms
O  1.602179 1.70484 0.751581
O  -5.734734 1.188488 -1.452118
O  -5.962681 -1.109178 -1.193559
N  -0.040563 0.007057 1.353036
C  0.891837 -1.14065 1.248111
C  2.230676 -0.69296 0.648355
C  2.504538 0.67229 0.379854
C  0.629733 1.214084 1.770404
C  3.702277 1.079914 -0.270761
C  -1.309819 0.008157 0.739083
C  3.202179 -1.659567 0.290937
C  4.412203 -1.296411 -0.339061
C  4.63414 0.079823 -0.617997
C  3.944256 2.546592 -0.560824
C  -2.046722 -1.210141 0.609741
C  -1.907653 1.214577 0.259501
C  5.445897 -2.340538 -0.726155
C  -3.321832 -1.216925 0.027646
C  -3.188969 1.200243 -0.312088
C  -3.915397 -0.01359 -0.438669
C  -5.26223 -0.075223 -1.039396
H  0.445831 -1.900406 0.584744
H  1.044035 -1.616622 2.239974
H  -0.068631 2.042438 1.939803
H  1.208728 1.003759 2.69163
H  2.999143 -2.719143 0.49684
H  5.56488 0.381467 -1.115477
H  4.931377 2.699785 -1.02867
H  3.169659 2.952245 -1.237721
H  3.892909 3.14985 0.363999
H  -1.633954 -2.145203 1.001393
H  -1.350683 2.15552 0.287865
H  5.591815 -2.377001 -1.82255
H  6.431686 -2.119135 -0.275522
H  5.145235 -3.349783 -0.39579
H  -3.889466 -2.149168 -0.061642
H  -3.632926 2.126007 -0.689018
H  -6.639454 1.066209 -1.846078
