program: Gaussian 09
title: 000259156
version: EM64L-G09RevD.01
frameworkgroup: C1[X(C10H8N2O)]
method: RPBEPBE
basis: SDD
operation: Freq
keyword: #p
keyword: freq=noraman
keyword: PBEPBE/SDD
title: #p freq=noraman PBEPBE/SDD
converged: YES YES NO NO
title: Mulliken charges:
elementType: O N N C C C C C C C C C C H H H H H H H H
charge: -0.252425 -0.409988 -0.067441 0.325270 0.128217 -0.339573 -0.334709 -0.221808 -0.242339 0.130822 -0.224570 -0.245879 -0.281207 0.285487 0.206859 0.336514 0.235462 0.234448 0.236816 0.252454 0.247591
chargesum: 0.00000
title: Mulliken charges with hydrogens summed into heavy atoms:
elementType: O N N C C C C C C C C C C
charge: -0.252425 -0.073474 -0.067441 0.325270 0.128217 -0.054087 -0.127850 0.013654 -0.007891 0.130822 0.012246 0.006575 -0.033616
polarizability: 2.08154698e+02 -1.23544322e+00 1.31237154e+02 -1.08964337e+00 -1.45177356e+00 4.87480603e+01
1716.lowfreq: -4.5892 -2.5604 -0.0005 -0.0002 0.0002 7.4710 29.5295 86.3255 133.8873
frequency: 29.5124 86.3242 133.8782 176.3799 220.0187 298.6770 368.0798 389.0870 403.4042 473.5346 496.9013 525.2789 614.8553 626.2321 654.7519 695.7245 722.9201 726.6631 775.4812 794.7919 833.5066 851.6789 869.1788 936.3220 945.6306 972.5576 987.5520 989.5501 1011.2164 1019.4562 1036.6719 1081.3403 1090.5810 1175.3403 1196.1246 1200.0816 1263.2082 1283.0293 1322.8926 1379.8786 1388.9132 1412.3926 1441.7940 1483.3780 1517.2140 1533.6983 1591.7911 1612.8400 1661.2271 3119.2604 3135.9994 3147.8369 3149.9193 3165.2438 3176.4456 3195.5981 3502.6420
redmass: 4.3404 4.7613 5.6489 7.1612 4.5006 7.0076 5.8069 2.9615 2.9568 3.5132 4.7830 8.7305 6.4396 7.4378 3.1013 1.5942 4.7168 2.9544 1.5558 2.6560 1.6157 1.2683 5.0636 1.4439 7.5531 1.3720 1.6369 3.5721 1.3731 2.9631 1.9787 1.9645 1.7266 1.0602 1.2542 2.3643 1.8464 2.1300 1.3935 1.7949 7.0748 2.9364 2.3363 2.7933 4.6782 4.5736 5.8973 5.9675 6.6543 1.0876 1.0870 1.0906 1.0925 1.0969 1.0987 1.0968 1.0768
irintensity: 0.0220 0.0095 0.7725 13.1197 0.0936 0.2857 1.5500 10.3629 3.3171 3.0376 3.1555 2.7164 0.3355 6.7993 24.9116 62.0633 3.2221 0.0307 102.7101 13.2569 52.8284 0.6064 3.5069 4.5077 20.8018 0.2822 1.3289 0.4227 2.1084 5.1459 3.5467 5.0403 16.2120 0.9805 3.3353 14.5975 60.5154 14.7744 2.5876 1.2735 0.9222 14.9387 33.0559 143.6049 179.2117 70.9888 10.6202 4.5595 572.4071 11.7219 0.7344 26.1855 22.5076 15.5582 15.1396 4.4351 17.9167
temp: 298.150 k
press: 1.00000 atm
elementType: 8 7 7 6 6 6 6 6 6 6 6 6 6 1 1 1 1 1 1 1 1
symmnumber: 1
zpe: 418061.9 jmol-1
zpe.correction: 0.159231 hartree
zpe.thermalcorrener: 0.169186 hartree
zpe.thermalcorrenthalpy: 0.170130 hartree
zpe.thermalcorrgfe: 0.122599 hartree
zpe.sumelectzpe: -569.705387 hartree
zpe.sumelectthermal: -569.695433 hartree
zpe.sumelectthermalent: -569.694488 hartree
zpe.sumelectthermalfe: -569.742020 hartree
dipole: 3.9692 0.8707 0.0107
dipole: 4.0636
quadrupole: -73.8041 -72.9809 -79.1013
quadrupole: -13.2573 -1.3298 -1.5465
quadrupole: 1.4913 2.3145 -3.8059 -13.2573 -1.3298 -1.5465
hfenergy: -569.8646187 hartree
pointgroup: C01 [X(C10H8N2O1)]
dipole: -1.559799 0.3473611 0.0484696 debye
dipolederiv: -0.8051458 0.3269951 0.0041857 0.736503 -1.0007117 -0.0027212 -0.0043313 0.0101398 -0.3802204 -1.0212394 0.4622618 -0.0045083 0.0375674 -0.450047 -0.0001565 -0.0062617 -0.0184458 -0.2277658 -1.2164265 -0.0600889 0.0155469 -0.7468741 -0.5685485 0.0242791 0.025364 0.0077813 -0.2485497 -0.3275215 0.0122018 0.0130279 -0.0300987 -0.0279537 0.0021874 -0.0018909 -0.0071853 -0.00831 1.2238395 -0.0679049 -0.0030542 0.482365 0.6811566 -0.043269 0.0097567 0.0034218 0.1480888 -0.066005 0.101161 0.0185089 -0.0880722 0.005463 0.0294797 0.0130823 0.0098672 -0.105063 0.0848497 -0.0712161 -0.0378449 0.097948 -0.0018478 0.0392274 -0.0370104 0.0438602 -0.1398424 0.0149785 -0.1632683 -0.0413346 -0.1661399 0.0430179 0.0463288 -0.047773 0.0437246 -0.1365607 -0.2272342 0.0890807 0.0200945 0.2159785 0.0945178 0.0444507 0.049673 0.0509177 -0.1333096 1.1755549 -0.5159107 -0.0178968 -1.0054156 1.2029292 0.0043664 -0.0117978 -0.0054695 0.2158552 0.092175 0.0206124 -0.0063946 -0.0902582 -0.0195361 0.02623 -0.0334345 0.0255654 -0.1356392 -0.208011 -0.0080322 -0.0024957 0.5038789 -0.5991932 0.0003801 0.0115619 -0.0023905 -0.1741095 0.9731523 -0.0628823 -0.0116083 0.1534172 0.4806815 -0.0048728 -0.0392245 -0.0024168 -0.0389266 0.1468429 -0.0589853 -0.0147639 -0.0359629 0.026085 -0.0291221 -0.0205943 -0.0200907 0.1498878 0.0121753 0.1189112 0.0331262 0.1083124 -0.016233 -0.0420614 0.0407923 -0.0390334 0.1375191 0.2254906 -0.0250069 0.004279 -0.0494721 0.1292668 0.002476 0.0182592 -0.0035889 0.3055165 -0.0050127 0.0834119 0.0239344 0.1091471 -0.0266957 -0.0429281 0.0286985 -0.0422999 0.1473984 0.0376575 -0.0631649 -0.0078259 -0.093347 -0.0667569 -0.0454618 -0.0098188 -0.0476268 0.1509797 -0.1203075 -0.0249763 0.0077954 -0.0292855 0.0950346 -0.0128787 0.0091754 -0.0117028 0.1578364 -0.034223 -0.0371339 0.0047989 0.0089015 0.0927142 0.0010835 0.0097738 0.0009098 0.1768367 0.0444103 -0.0560652 0.0024295 -0.1190928 -0.0733432 0.0029823 -0.0040001 0.0040627 0.1383784 unknown
polarizability: 208.0815557|1.173571|130.5512906|-3.7212844|7.5700568|49.5070661 unknown
InChI: InChI=1S/C10H8N2O/c13-9-6-7-11-10(12-9)8-4-2-1-3-5-8/h1-7,12H
charge 0 multiplicity 1
21 atoms
O  3.449624 -1.815093 -0.047377
N  1.324208 -0.830557 -0.007147
N  0.947637 1.517678 -0.035685
C  -0.998679 0.037238 -0.002886
C  0.470214 0.263034 -0.016433
C  -1.848386 1.146774 0.256232
C  -1.581204 -1.237334 -0.243835
C  -3.246678 0.982029 0.288129
C  -2.982347 -1.398431 -0.2131
C  2.761783 -0.753034 -0.049573
C  -3.819805 -0.291392 0.056573
C  3.237047 0.624502 -0.078051
C  2.329103 1.673129 -0.059465
H  -1.381109 2.121118 0.425604
H  -0.964537 -2.11168 -0.486756
H  0.95253 -1.784453 0.048455
H  -3.890799 1.843789 0.492901
H  -3.420047 -2.38356 -0.406123
H  -4.907416 -0.419551 0.080817
H  4.316358 0.789102 -0.104696
H  2.673599 2.712489 -0.068183
