program: Gaussian 09
title: 000259158
version: EM64L-G09RevD.01
frameworkgroup: C1[X(C13H12N2O)]
method: RPBEPBE
basis: SDD
operation: Freq
keyword: #p
keyword: freq=noraman
keyword: PBEPBE/SDD
title: #p freq=noraman PBEPBE/SDD
converged: YES YES NO NO
title: Mulliken charges:
elementType: O N N C C C C C C C C C C C C C H H H H H H H H H H H H
charge: -0.257563 -0.418792 -0.050504 0.258735 0.105924 0.326396 -0.558085 0.054442 -0.415599 -0.344856 -0.333329 -0.036698 -0.223602 -0.245768 -0.227080 -0.590361 0.240103 0.250310 0.337178 0.266991 0.286597 0.203116 0.229382 0.234372 0.233221 0.235932 0.217442 0.222092
chargesum: 0.00000
title: Mulliken charges with hydrogens summed into heavy atoms:
elementType: O N N C C C C C C C C C C C C C
charge: -0.257563 -0.081613 -0.050504 0.258735 0.105924 0.326396 -0.067672 0.054442 -0.148607 -0.058258 -0.130213 0.192684 0.010770 -0.012547 0.008852 -0.150826
polarizability: 2.77961092e+02 5.06074208e-01 1.59337036e+02 -7.83634222e+00 1.57723313e-02 7.42597810e+01
1716.lowfreq: -5.2049 -4.8876 -0.0003 0.0002 0.0006 5.5611 16.9049 38.4712 59.4367
frequency: 16.3898 38.4656 59.4319 68.7654 114.6899 142.6532 182.5257 192.1713 257.3975 292.9533 342.1685 368.4589 392.7157 401.6313 411.4472 489.8633 508.5274 563.4933 587.5561 615.8784 638.5209 680.2835 695.1682 713.9956 729.4398 774.7388 788.0292 799.1176 850.6462 893.2651 906.4447 934.4298 939.1911 950.0380 957.2188 986.9378 988.7659 1011.9426 1012.1704 1020.0733 1047.5665 1087.0024 1109.6740 1122.8718 1174.6309 1196.3836 1205.7403 1214.2433 1243.1095 1278.8419 1287.9459 1298.1185 1324.0909 1369.3242 1387.7107 1419.3198 1427.8296 1442.2710 1447.2056 1486.3527 1522.6005 1555.1874 1592.1773 1613.3623 1633.0418 1659.2167 2970.3073 3015.1252 3080.7411 3094.4384 3118.6702 3135.5732 3143.6641 3149.3002 3164.4601 3175.8123 3197.2511 3504.6495
redmass: 3.9342 4.7519 2.8394 3.5910 3.6291 4.8620 3.9602 4.5292 5.5835 4.9477 4.5513 3.2241 2.7780 2.7360 3.0002 3.4288 3.3993 5.1297 4.3573 6.3652 2.6116 4.2465 1.6165 5.7661 2.3473 2.0965 2.2680 3.6373 1.2603 1.7343 3.2866 1.4387 2.1467 1.3486 1.5503 1.4547 4.8666 1.3288 1.1838 3.0056 2.2530 1.6201 2.9391 2.0324 1.0615 1.1622 1.8499 2.2871 2.5789 1.8646 1.3369 1.4513 1.3983 1.9115 8.4956 2.7451 1.2379 2.2371 1.1653 2.8330 4.4898 4.7594 5.8475 5.9554 6.5712 4.7443 1.0598 1.0980 1.0719 1.0813 1.0875 1.0870 1.0924 1.0925 1.0968 1.0988 1.1144 1.0766
irintensity: 0.0139 0.1696 0.4583 0.7265 0.1339 5.7505 3.3610 3.5418 2.4580 1.4257 1.9015 2.3362 5.3297 2.8600 6.0886 1.4633 0.8416 2.4593 14.9092 0.0560 2.1515 2.5235 62.3563 3.2072 2.1795 79.8964 63.2195 6.6884 1.0577 18.9860 3.0645 5.8636 1.1696 51.4887 42.3842 0.7773 0.9352 4.7578 13.9298 1.3202 21.7289 13.3430 16.0778 1.9825 0.8692 2.7984 0.6268 39.8954 13.6176 33.8530 0.4600 0.0310 2.0219 3.5336 0.3203 1.0709 4.2210 41.8041 8.0940 109.4323 177.9991 27.1800 11.4577 1.1219 510.3958 25.8702 6.6761 6.5031 18.5084 6.6802 13.5767 0.5651 23.4716 23.3045 17.1266 17.6646 26.5873 18.7241
temp: 298.150 k
press: 1.00000 atm
elementType: 8 7 7 6 6 6 6 6 6 6 6 6 6 6 6 6 1 1 1 1 1 1 1 1 1 1 1 1
symmnumber: 1
zpe: 575484.0 jmol-1
zpe.correction: 0.219190 hartree
zpe.thermalcorrener: 0.233080 hartree
zpe.thermalcorrenthalpy: 0.234024 hartree
zpe.thermalcorrgfe: 0.176242 hartree
zpe.sumelectzpe: -686.181743 hartree
zpe.sumelectthermal: -686.167854 hartree
zpe.sumelectthermalent: -686.166910 hartree
zpe.sumelectthermalfe: -686.224692 hartree
dipole: 3.0233 -1.3546 -0.0252
dipole: 3.3130
quadrupole: -77.6332 -97.6718 -95.7216
quadrupole: 10.2807 -1.2252 2.0505
quadrupole: 12.7090 -7.3296 -5.3794 10.2807 -1.2252 2.0505
hfenergy: -686.4009337 hartree
pointgroup: C01 [X(C13H12N2O1)]
dipole: 1.1957088 0.4901142 0.1704463 debye
polarizability: 278.0788568|-3.6735912|149.8863692|4.6628421|26.8003572|83.5926831 unknown
InChI: InChI=1S/C13H12N2O/c1-2-6-11-9-14-12(15-13(11)16)10-7-4-3-5-8-10/h2-5,7-9,15H,1,6H2
charge 0 multiplicity 1
28 atoms
O  -1.916056 -2.626651 -0.737537
N  -0.045183 -1.284369 -0.329904
N  -0.17043 0.993304 0.321118
C  -2.239165 -0.298252 -0.060191
C  0.56438 -0.082433 0.005293
C  2.047625 0.006086 0.01576
C  -3.751174 -0.411356 -0.121993
C  -1.458966 -1.48997 -0.406049
C  -1.553667 0.861334 0.288626
C  2.64761 1.181771 0.543764
C  2.885196 -1.030296 -0.480744
C  -4.49166 0.575039 0.756644
C  4.049136 1.312829 0.583226
C  4.289007 -0.895906 -0.439939
C  4.87681 0.273731 0.094195
C  -5.435137 1.448897 0.325148
H  -4.081274 -0.302634 -1.174791
H  -4.014071 -1.451957 0.158376
H  0.515216 -2.116426 -0.540166
H  -2.111013 1.764935 0.557595
H  1.986628 1.971854 0.91144
H  2.467992 -1.942392 -0.925239
H  -4.23948 0.541151 1.828201
H  4.498091 2.22304 0.994971
H  4.922498 -1.699888 -0.829445
H  5.967061 0.375298 0.125169
H  -5.958655 2.117076 1.017991
H  -5.714118 1.517486 -0.733921
