program: Gaussian 09
title: 000259211
version: EM64L-G09RevD.01
frameworkgroup: C1[X(C23H31NOS)]
method: RPBEPBE
basis: SDD
operation: Freq
keyword: #p
keyword: freq=noraman
keyword: PBEPBE/SDD
title: #p freq=noraman PBEPBE/SDD
converged: YES YES NO NO
title: Mulliken charges:
elementType: S O N C C C C C C C C C C C C C C C C C C C C C C C H H H H H H H H H H H H H H H H H H H H H H H H H H H H H H H
charge: 0.237818 -0.237557 -0.044735 -0.102457 0.395094 -0.158878 -0.099571 -0.273196 0.231699 -0.535464 -0.526976 -0.562810 -0.488457 -0.481717 -0.826544 0.540596 -0.641269 -0.492354 -0.810980 0.448375 -0.563360 -0.587595 0.178202 -0.796815 -0.162190 -0.734415 0.208318 0.230454 0.199607 0.234465 0.193815 0.218964 0.220071 0.222603 0.209169 0.233001 0.260395 0.212624 0.227327 0.216706 0.228755 0.218536 0.243887 0.221686 0.234627 0.217873 0.214701 0.228062 0.233362 0.221707 0.244349 0.230778 0.254949 0.276078 0.241987 0.240430 0.256270
chargesum: 0.00000
title: Mulliken charges with hydrogens summed into heavy atoms:
elementType: S O N C C C C C C C C C C C C C C C C C C C C C C C
charge: 0.237818 -0.237557 -0.044735 0.105861 0.395094 0.071576 0.100036 -0.038731 0.231699 -0.122686 -0.084302 -0.120639 -0.015438 -0.037684 -0.135366 0.540596 -0.184956 -0.059779 -0.127849 0.448375 -0.088233 -0.332646 0.178202 -0.520737 -0.162190 0.004272
polarizability: 3.63137667e+02 4.59275318e+00 2.37460189e+02 -2.23678557e+01 1.11809919e+01 2.03262755e+02
1716.lowfreq: 0.0013 0.0017 0.0022 1.8072 7.1256 13.2661 27.9245 32.0921 40.6393
frequency: 27.7228 32.0085 40.5728 50.0760 55.6304 61.9670 100.8861 133.9723 151.4662 162.6865 168.9053 178.8453 191.1198 203.4948 218.1329 230.6767 234.2406 258.4622 265.7532 267.4725 280.1373 299.7417 311.2651 318.1027 336.3869 367.8176 373.3689 390.3488 413.1806 429.4377 450.7623 468.9039 494.9858 497.2666 518.0985 527.4768 534.8961 548.4665 557.0232 562.4856 598.1034 627.4456 645.0812 668.0202 678.6555 714.1666 728.1659 746.1044 775.8582 776.4550 805.7716 808.3046 831.9279 840.4619 843.3121 865.2900 885.3104 898.7243 913.9102 918.9094 927.8233 939.9105 955.1326 958.2822 969.6131 992.8261 1000.8793 1015.1592 1024.2378 1028.3311 1030.9006 1033.7478 1035.9514 1050.4782 1075.7057 1080.2214 1093.4236 1111.1671 1115.8499 1121.6914 1124.7420 1131.8632 1135.1490 1154.1202 1164.5861 1177.8994 1187.8779 1188.5623 1203.7213 1208.5249 1216.6958 1232.7466 1237.3551 1245.7705 1252.9859 1262.7826 1273.2057 1279.3353 1283.5711 1287.9353 1301.2843 1303.9173 1318.6252 1320.2486 1323.2469 1331.9403 1335.6048 1341.3153 1346.1981 1349.2345 1354.2245 1355.2921 1372.4215 1386.0000 1393.9796 1399.0112 1442.7641 1456.9388 1457.9913 1458.6562 1459.4279 1465.0192 1467.3156 1468.2785 1472.0784 1477.6517 1479.0947 1484.8593 1489.8119 1493.7049 1508.7118 1540.3628 1584.7132 1623.0429 2904.0235 2915.1668 2951.8011 2952.2076 2960.3562 2970.8062 2973.5060 2974.2595 2978.8009 2986.6149 2988.9333 2989.0065 2991.0940 2995.4988 3014.0525 3018.8826 3035.0977 3039.6099 3042.3595 3048.9252 3051.0956 3060.5313 3069.0889 3075.7359 3077.9669 3079.6918 3084.0744 3092.3568 3112.2984 3118.1226 3231.6425
redmass: 5.2996 4.5422 6.0648 3.9026 1.3466 2.3076 3.0159 4.7239 2.5358 2.5385 1.7467 3.1626 1.9138 1.9902 2.4275 2.3442 2.1004 2.5024 3.4423 2.1643 2.5537 2.7863 3.5260 3.0232 4.1709 2.5156 3.2633 2.7163 3.0593 3.6432 3.3015 3.1684 3.1536 3.9208 3.5888 2.7628 2.7271 3.7385 4.5025 3.9089 3.2205 3.3971 3.7286 3.1142 3.5333 3.2411 3.1872 3.0985 1.9463 1.5779 2.4156 2.9753 1.9919 1.8438 2.2126 2.3445 1.5410 2.2461 1.9539 1.9624 1.7844 2.0491 2.4296 1.9230 2.3172 2.2015 2.0786 2.2502 2.4232 2.1461 1.9621 1.7989 1.4095 2.1714 2.3372 2.7565 1.5774 2.2157 1.8002 2.1379 1.6951 2.0569 1.8251 1.8254 1.9820 1.4595 1.8471 1.8939 2.2536 1.7604 1.2253 1.4123 1.6928 1.4230 1.4891 1.5324 1.4415 2.0172 1.4480 1.5762 1.9607 1.4667 1.4522 1.4651 1.4165 1.4055 1.3338 1.7697 1.7127 1.4644 1.4118 1.4715 1.4637 1.2173 1.2346 1.2094 1.0787 1.1187 1.0479 1.0716 1.0838 1.0850 1.0865 1.0858 1.0771 1.0611 1.0699 1.0611 1.0825 1.0677 6.6986 6.1984 9.9953 7.6785 1.0811 1.0806 1.0619 1.0663 1.0763 1.0681 1.0681 1.0795 1.0623 1.0376 1.0428 1.0444 1.0509 1.0591 1.0643 1.0940 1.0960 1.0983 1.0987 1.0996 1.1000 1.0957 1.0980 1.0983 1.0989 1.1033 1.0989 1.0982 1.0988 1.0912 1.0957
irintensity: 1.3626 0.5719 0.1939 2.5331 0.3779 0.0583 0.3025 1.3365 0.6729 0.5394 1.0564 1.6942 1.4067 1.0922 0.9428 0.8539 2.5635 0.1390 0.2585 1.3004 0.4236 0.8716 4.0886 3.0158 0.9262 0.7420 2.7730 0.2140 0.2945 0.5757 3.0979 0.3480 0.8259 3.8381 3.8471 0.4600 1.6839 10.9771 7.2525 3.8443 2.1447 3.4400 0.1235 6.1150 2.7183 5.0016 12.0280 7.4924 16.8817 34.1370 1.8776 1.2950 1.7524 2.0244 6.7300 5.4851 18.4490 3.8236 5.1189 11.7995 5.8407 20.2134 1.9492 11.3268 1.5506 0.9847 3.3597 2.7356 1.1247 2.3325 4.3906 3.7886 2.4056 3.6442 1.8761 3.7993 1.7585 26.1605 8.8995 5.2490 8.2159 13.9751 4.4588 15.7995 2.7260 4.7974 2.0110 24.2606 2.4665 19.2491 8.6182 25.7220 6.9748 9.9422 12.1456 2.8060 4.3069 36.5065 1.4633 0.3474 6.8019 0.2693 1.4880 9.5492 8.5026 2.0359 1.1182 3.2249 6.2339 0.6008 3.9358 3.5433 4.5403 14.7540 15.9088 20.0124 18.6286 30.7562 13.4030 10.0534 15.6335 10.2125 8.6309 7.3693 7.3350 2.0695 8.7533 5.9158 11.7320 10.0427 10.7442 62.5230 167.6180 212.1285 8.0110 17.5733 36.6592 11.2603 6.5954 27.6304 9.7315 48.3109 31.5617 20.9202 25.4210 11.9460 23.0326 31.3414 38.3261 40.9120 43.2289 19.9246 61.9508 29.6868 35.9852 23.0723 12.9388 66.3806 26.3572 37.1869 23.7832 23.5734 6.2106 11.2485 3.0589
temp: 298.150 k
press: 1.00000 atm
elementType: 16 8 7 6 6 6 6 6 6 6 6 6 6 6 6 6 6 6 6 6 6 6 6 6 6 6 1 1 1 1 1 1 1 1 1 1 1 1 1 1 1 1 1 1 1 1 1 1 1 1 1 1 1 1 1 1 1
symmnumber: 1
zpe: 1281449.1 jmol-1
zpe.correction: 0.488078 hartree
zpe.thermalcorrener: 0.512754 hartree
zpe.thermalcorrenthalpy: 0.513698 hartree
zpe.thermalcorrgfe: 0.434146 hartree
zpe.sumelectzpe: -1421.118502 hartree
zpe.sumelectthermal: -1421.093827 hartree
zpe.sumelectthermalent: -1421.092883 hartree
zpe.sumelectthermalfe: -1421.172435 hartree
dipole: -5.3123 0.4450 1.6521
dipole: 5.5811
quadrupole: -211.6188 -160.6134 -160.6883
quadrupole: 6.8842 6.8924 -0.7946
quadrupole: -33.9787 17.0268 16.9519 6.8842 6.8924 -0.7946
hfenergy: -1421.6065802 hartree
pointgroup: C01 [X(C23H31N1O1S1)]
dipole: 2.1005009 -0.1007671 0.6317447 debye
polarizability: 363.2740861|8.3827555|237.0428046|20.7157931|-11.8043193|203.5437216 unknown
InChI: InChI=1S/C23H31NOS/c1-14-24-21(13-26-14)20-7-6-18-17-5-4-15-12-16(25)8-10-22(15,2)19(17)9-11-23(18,20)3/h12-13,17-20H,4-11H2,1-3H3
charge 0 multiplicity 1
57 atoms
S  6.134573 1.821958 -0.741792
O  -7.034402 0.688682 -0.806519
N  4.861117 -0.219566 0.404964
C  0.501567 -1.195937 -0.475504
C  1.49274 -0.046776 -0.107778
C  -0.862149 -1.083512 0.235781
C  -1.511266 0.290992 -0.134591
C  2.736878 -0.499399 -0.962106
C  -2.941121 0.511707 0.514242
C  0.849515 1.290494 -0.543986
C  -0.542689 1.483988 0.116746
C  1.344135 -2.485181 -0.314344
C  2.783744 -2.057274 -0.763093
C  -1.804842 -2.240568 -0.161916
C  1.855661 -0.012287 1.399595
C  -3.815384 -0.722301 0.222298
C  -3.200051 -2.083394 0.488443
C  -3.585321 1.782692 -0.124848
C  -2.852883 0.686709 2.064518
C  4.046263 0.195646 -0.674259
C  -5.106472 1.900032 0.101429
C  -5.110859 -0.625792 -0.221751
C  -5.843429 0.647166 -0.367791
C  4.562876 1.259046 -1.398572
C  5.967355 0.486463 0.532335
C  7.029881 0.288138 1.572039
H  0.295397 -1.08086 -1.566402
H  -0.699909 -1.133087 1.333493
H  -1.689195 0.246996 -1.235132
H  2.479132 -0.284616 -2.019556
H  0.730004 1.292451 -1.648707
H  1.503662 2.147349 -0.286985
H  -0.407133 1.637198 1.204173
H  -0.990097 2.415554 -0.27644
H  0.953867 -3.321065 -0.92168
H  1.343467 -2.820311 0.74059
H  3.538197 -2.311752 0.000244
H  3.085428 -2.557261 -1.700838
H  -1.367318 -3.211495 0.138363
H  -1.911679 -2.260099 -1.26639
H  2.530627 0.837585 1.606238
H  0.963738 0.106087 2.038994
H  2.385391 -0.925776 1.71785
H  -3.08636 -2.214798 1.586171
H  -3.885154 -2.880452 0.145993
H  -3.393165 1.760539 -1.217032
H  -3.08936 2.688183 0.270814
H  -2.292785 1.602046 2.324589
H  -3.861554 0.772687 2.506919
H  -2.349787 -0.167993 2.549522
H  -5.527809 2.776195 -0.422666
H  -5.331019 2.039311 1.178989
H  -5.688467 -1.53196 -0.448086
H  4.136448 1.748778 -2.272102
H  8.006976 0.049214 1.114078
H  7.165637 1.192338 2.19284
H  6.734686 -0.547408 2.226818
