program: Gaussian 09
title: 000259148
version: EM64L-G09RevD.01
frameworkgroup: C1[X(C14H11N3)]
method: RPBEPBE
basis: SDD
operation: Freq
keyword: #pfreq=noraman
keyword: PBEPBE/SDD
title: #p freq=noraman PBEPBE/SDD
converged: YES YES NO NO
title: Mulliken charges:
elementType: N N N C C C C C C C C C C C C C C H H H H H H H H H H H
charge: -0.276857 -0.035035 -0.321467 0.233670 0.005910 0.046227 0.468693 -0.290983 -0.303525 -0.336386 -0.374491 -0.318255 -0.267694 -0.211576 -0.217900 -0.216195 -0.238855 0.266046 0.209736 0.261141 0.254472 0.270701 0.232479 0.235115 0.230105 0.229939 0.231355 0.233630
chargesum: 0.00000
title: Mulliken charges with hydrogens summed into heavy atoms:
elementType: N N N C C C C C C C C C C C C C C
charge: -0.276857 -0.035035 -0.087836 0.233670 0.005910 0.046227 0.468693 -0.024936 -0.093790 -0.075245 -0.120019 -0.047553 -0.035215 0.023539 0.012205 0.013744 -0.007500
polarizability: 2.81970125e+02 -3.22571994e+00 1.59406200e+02 -9.71672763e-02 -4.90868601e+00 8.71745915e+01
1716.lowfreq: -9.8847 -0.0003 0.0005 0.0005 2.1367 6.3110 34.4080 49.9887 83.2661
frequency: 34.3327 49.8551 83.2601 102.3243 166.2928 228.0007 250.4681 272.0529 337.7017 387.3305 407.1206 415.2361 463.2621 486.8401 506.7931 537.6841 550.5497 581.7814 602.7551 613.5752 665.4977 680.8573 697.9997 738.5237 747.9129 768.0480 775.0477 795.6666 834.3322 840.5321 868.1692 879.3391 908.8088 921.6425 958.5703 969.2631 985.0067 989.8313 993.7029 994.3251 1029.1420 1029.9445 1083.0001 1099.4431 1134.4345 1168.4652 1172.9659 1185.3987 1187.3918 1223.2761 1260.8161 1281.9723 1303.4731 1321.6374 1372.8060 1384.7228 1398.8151 1441.5762 1448.2241 1459.2146 1480.9264 1555.1952 1564.3191 1587.7059 1598.7302 1611.2302 1620.9762 3121.0522 3129.9659 3138.5660 3140.4391 3150.6850 3155.6194 3159.4136 3166.5010 3174.4435 3192.2984 3394.6440
redmass: 5.7045 4.0422 4.7881 4.4017 5.3916 4.6556 6.0963 4.9132 5.0423 5.2914 2.8883 3.0165 3.8770 6.6228 4.1419 4.9503 7.9207 3.3872 5.3230 6.3045 4.3556 5.9652 1.9105 4.4816 1.6628 1.8142 1.3740 2.3711 4.0389 1.3518 4.1930 1.5169 1.4079 1.4075 1.3885 1.3817 3.5680 2.8019 1.7186 1.3352 1.9583 2.1904 1.5766 2.6740 1.7936 1.2023 1.0509 1.2225 2.0241 2.5602 2.6894 1.9340 2.6707 1.3945 3.1489 9.8253 1.9993 2.2944 2.6330 2.6525 2.3538 6.6360 7.1901 7.6235 6.8076 6.3070 6.7821 1.0873 1.0852 1.0893 1.0886 1.0942 1.0927 1.0945 1.0998 1.0995 1.0960 1.0759
irintensity: 1.8819 0.6229 0.7469 0.7542 0.3409 0.2379 0.9407 0.1613 2.4435 2.0545 0.6268 2.8505 7.7387 1.3444 1.5644 11.0497 5.6865 1.0757 17.7838 0.6733 17.4465 2.3865 51.4998 35.2736 19.5594 56.1203 84.0375 22.8727 6.6021 4.9481 11.6623 0.1281 9.0686 2.8981 3.1730 1.1918 47.2407 9.3957 3.7475 0.3274 6.5680 17.2640 9.2694 29.1265 30.2299 2.9417 0.0794 15.0172 32.4014 43.9362 94.8328 52.8549 23.8419 7.1352 6.4492 8.3950 8.8793 8.6174 17.0721 49.0667 74.2238 114.5923 215.9826 154.2560 27.6527 4.1577 23.1302 4.5307 2.0054 8.0433 8.1839 27.9406 3.5422 20.7720 28.1059 19.9780 1.6619 17.9516
temp: 298.150 k
press: 1.00000 atm
elementType: 7 7 7 6 6 6 6 6 6 6 6 6 6 6 6 6 6 1 1 1 1 1 1 1 1 1 1 1
symmnumber: 1
zpe: 568344.2 jmol-1
zpe.correction: 0.216471 hartree
zpe.thermalcorrener: 0.229193 hartree
zpe.thermalcorrenthalpy: 0.230137 hartree
zpe.thermalcorrgfe: 0.176383 hartree
zpe.sumelectzpe: -703.180985 hartree
zpe.sumelectthermal: -703.168263 hartree
zpe.sumelectthermalent: -703.167319 hartree
zpe.sumelectthermalfe: -703.221073 hartree
dipole: 0.2214 0.6492 0.1424
dipole: 0.7005
quadrupole: -76.9701 -97.2625 -100.7844
quadrupole: 7.8557 1.8008 -4.1773
quadrupole: 14.7023 -5.5902 -9.1121 7.8557 1.8008 -4.1773
hfenergy: -703.3974557 hartree
pointgroup: C01 [X(C14H11N3)]
dipole: 0.08631 -0.256538 0.0519009 debye
polarizability: 281.9893122|2.6686224|144.0175784|-0.9806436|-29.9619624|102.5440255 unknown
InChI: InChI=1S/C14H11N3/c15-14-12-8-4-5-9-13(12)16-10-17(14)11-6-2-1-3-7-11/h1-10,15H
charge 0 multiplicity 1
28 atoms
N  -0.504301 0.273964 -0.021583
N  1.26719 1.890708 -0.392883
N  -0.164399 -1.997509 0.513358
C  1.824775 -0.485134 0.108646
C  0.379469 -0.8362 0.228434
C  2.21455 0.858878 -0.201399
C  -1.947722 0.097002 -0.028714
C  -0.002136 1.552014 -0.297114
C  2.835089 -1.465432 0.292474
C  3.59169 1.18847 -0.317402
C  -2.681127 0.539642 -1.154889
C  -2.615357 -0.462596 1.08487
C  4.195891 -1.130899 0.173791
C  4.575742 0.203413 -0.132445
C  -4.090448 0.43661 -1.160226
C  -4.021773 -0.568226 1.068268
C  -4.764395 -0.116978 -0.048901
H  -0.767654 2.323761 -0.422596
H  2.559254 -2.500098 0.529558
H  3.847813 2.225805 -0.55283
H  -2.152116 0.939948 -2.027026
H  -2.035832 -0.825725 1.935849
H  4.96171 -1.900051 0.31859
H  5.635794 0.463347 -0.223448
H  -4.655027 0.778501 -2.034336
H  -4.53895 -1.00359 1.930071
H  -5.856443 -0.202868 -0.054567
H  0.539611 -2.743259 0.657353
