program: Gaussian 09
title: 000259180
version: EM64L-G09RevD.01
frameworkgroup: C1[X(C21H18Br2N2O)]
method: RPBEPBE
basis: SDD
operation: Freq
keyword: #p
keyword: freq=noraman
keyword: PBEPBE/SDD
title: #p freq=noraman PBEPBE/SDD
converged: YES YES NO NO
title: Mulliken charges:
elementType: Br Br O N N C C C C C C C C C C C C C C C C C C C C C H H H H H H H H H H H H H H H H H H
charge: 0.024050 0.009452 -0.397565 -0.241473 -0.082188 -0.435464 0.236339 0.232359 0.193061 0.186577 -0.494838 -0.329610 -0.355656 -0.405042 -0.399289 -0.630656 0.419701 -0.241714 -0.234387 -0.258066 -0.255192 0.270916 -0.338660 -0.395250 -0.238101 -0.175622 0.208933 0.236251 0.199769 0.268033 0.258050 0.229331 0.234467 0.234551 0.225130 0.192149 0.256312 0.222330 0.221157 0.222236 0.223290 0.264395 0.272226 0.367709
chargesum: 0.00000
title: Mulliken charges with hydrogens summed into heavy atoms:
elementType: Br Br O N N C C C C C C C C C C C C C C C C C C C C C
charge: 0.024050 0.009452 -0.029856 -0.241473 -0.082188 0.009720 0.236339 0.232359 0.193061 0.186577 -0.027036 -0.071560 -0.126325 -0.170575 -0.164738 0.042935 0.419701 -0.019384 -0.013229 -0.035830 -0.031902 0.270916 -0.074266 -0.395250 -0.238101 0.096604
polarizability: 3.17140810e+02 2.13981876e+01 3.21966715e+02 -5.32981636e+01 2.76240470e+01 2.11331948e+02
1716.lowfreq: -3.2956 -0.0006 0.0004 0.0007 4.4585 7.7492 10.2804 16.5229 20.0704
frequency: 9.6741 16.4615 20.0411 45.7943 55.1121 73.2947 97.2120 109.4063 116.6367 138.9016 144.6973 147.7385 195.9772 203.5834 221.1118 245.5150 251.0786 257.6163 286.3133 293.5196 306.1445 323.7639 333.8261 358.1434 374.1735 400.3647 422.1915 425.4609 439.8780 451.9332 487.2864 524.2182 529.8305 552.9933 568.4720 577.4605 586.2954 610.5391 613.3943 645.0754 652.2450 723.5939 730.2647 730.8493 747.6300 758.7458 777.3959 779.1330 796.2523 812.4482 848.8892 850.8600 857.9762 863.5852 880.3789 900.6638 932.6399 935.9259 962.0707 971.0590 972.8005 990.1652 1011.3032 1016.3632 1019.3500 1046.7189 1056.0872 1079.8681 1109.7313 1111.6529 1120.6716 1133.9847 1148.1261 1166.6918 1170.5124 1195.3615 1199.2496 1222.4910 1231.2439 1238.9331 1269.6437 1276.1198 1303.5829 1310.9675 1333.9949 1342.0579 1366.7560 1378.5323 1387.5370 1398.9162 1403.1643 1407.9287 1436.2870 1443.2670 1447.7546 1453.1806 1463.7476 1469.6847 1474.2421 1481.7621 1489.2341 1490.5025 1570.2982 1583.2072 1586.3221 1589.9821 1610.3819 1637.5500 2861.0123 2871.7378 2896.9341 2999.6290 3025.7214 3062.4487 3083.7900 3124.5949 3125.2699 3133.1564 3136.2668 3146.3464 3153.3117 3155.8478 3163.8377 3171.2228 3185.9651 3505.3047
redmass: 9.5902 6.2494 8.3683 7.1540 7.0627 3.5249 4.9904 7.3513 9.0634 6.8811 6.8406 3.6281 4.8941 2.6496 2.7083 2.8177 4.2078 2.8523 3.5502 3.5090 7.1482 6.3451 3.6648 3.2690 2.8752 1.1168 2.9566 4.5089 3.8041 2.9974 3.9270 5.3586 4.3054 4.0026 3.9836 3.5343 4.8593 5.8898 6.8767 6.8050 7.5251 4.7453 5.9135 2.3915 1.5018 1.7495 2.5860 5.0475 5.8679 4.4405 2.7422 1.6546 1.5921 1.3829 4.4075 1.5624 1.3872 1.4109 1.9143 1.3152 1.3031 6.9067 2.1096 2.1249 2.1498 2.0316 3.4960 2.0436 2.1703 1.3348 1.5023 1.7048 2.0305 1.1030 1.0922 2.1090 2.0058 1.7450 2.1217 2.1126 1.8974 1.3279 1.5172 1.9386 2.2455 2.2936 2.5482 1.9625 1.3283 4.1558 5.0925 3.5454 1.2259 2.7871 2.7847 2.7822 1.1751 1.1358 2.0335 1.2841 3.6673 1.0912 7.2716 7.1209 7.9120 6.6714 7.4186 7.6641 1.0580 1.0701 1.0677 1.0911 1.0732 1.0879 1.1002 1.0849 1.0849 1.0890 1.0905 1.0949 1.0926 1.0962 1.1001 1.0976 1.0933 1.0653
irintensity: 0.1078 0.0126 0.2181 0.1507 0.3625 1.3336 0.5926 0.0818 0.5260 1.7462 1.1508 0.0478 0.4400 0.7721 0.1423 5.6812 3.1159 2.1948 0.6543 0.5797 0.4431 1.2849 0.2329 7.2631 8.4308 100.9822 9.8838 2.8569 0.9109 0.5844 1.9094 3.1622 8.9286 11.1109 5.2323 0.1671 2.0099 20.4360 4.4350 41.2733 40.6049 3.0080 4.5376 61.4800 6.9020 131.6752 0.6034 1.8087 8.5455 14.5274 8.3787 2.3973 0.2017 20.1341 9.8047 7.6249 3.3481 1.7359 36.3784 0.1773 0.0301 8.1612 74.5833 8.5773 17.0630 8.6044 27.0587 83.0101 140.7021 16.2420 3.8200 11.9835 23.7901 9.9085 5.1291 14.0765 30.7758 71.9710 58.1020 3.5874 22.2778 7.9355 20.1863 3.2185 56.9520 90.0020 34.2933 23.0413 55.1147 33.6204 1.0252 17.7131 48.4708 107.1143 12.9438 74.0654 35.1579 23.2866 20.6752 21.3166 32.7969 17.4784 18.3695 0.7691 0.4312 1.1340 30.6467 14.0581 93.4683 80.6849 135.1798 31.5881 27.8057 2.5193 28.1575 0.6331 1.4154 8.7964 8.5024 32.3065 2.2606 37.6021 35.9181 14.2970 0.2454 56.6310
temp: 298.150 k
press: 1.00000 atm
elementType: 35 35 8 7 7 6 6 6 6 6 6 6 6 6 6 6 6 6 6 6 6 6 6 6 6 6 1 1 1 1 1 1 1 1 1 1 1 1 1 1 1 1 1 1
symmnumber: 1
zpe: 881791.6 jmol-1
zpe.correction: 0.335857 hartree
zpe.thermalcorrener: 0.359233 hartree
zpe.thermalcorrenthalpy: 0.360177 hartree
zpe.thermalcorrgfe: 0.279169 hartree
zpe.sumelectzpe: -1020.855232 hartree
zpe.sumelectthermal: -1020.831857 hartree
zpe.sumelectthermalent: -1020.830912 hartree
zpe.sumelectthermalfe: -1020.911921 hartree
dipole: 0.2321 -1.3254 0.9012
dipole: 1.6195
quadrupole: -183.1244 -152.7204 -167.6351
quadrupole: -0.4401 -6.1041 -3.1387
quadrupole: -15.2978 15.1063 0.1915 -0.4401 -6.1041 -3.1387
hfenergy: -1021.1910892 hartree
pointgroup: C01 [X(C21H18Br2N2O1)]
dipole: 0.1118691 0.4100142 -0.4747008 debye
polarizability: 322.0456538|-7.2084547|330.3225293|48.8172104|-6.9499739|198.0712891 unknown
InChI: InChI=1S/C21H18Br2N2O/c1-24(12-14-10-15(22)11-18(23)21(14)26)13-25-19-8-4-2-6-16(19)17-7-3-5-9-20(17)25/h2-11,26H,12-13H2,1H3
charge 0 multiplicity 1
44 atoms
Br -3.393685 -2.714995 1.893456
Br -6.437971 2.01914 0.389164
O  -0.998631 -0.830934 0.97422
N  1.65681 0.505505 -0.902659
N  -0.584271 1.281492 -1.499447
C  0.868017 1.387803 -1.754568
C  1.651609 -0.903298 -0.98094
C  2.603794 0.90021 0.070331
C  2.612586 -1.424472 -0.04966
C  3.216704 -0.279095 0.621392
C  -0.994209 1.73984 -0.147491
C  0.871255 -1.746495 -1.798765
C  2.968368 2.193268 0.50476
C  2.794515 -2.823595 0.05325
C  4.206052 -0.148733 1.622766
C  -1.406782 1.82694 -2.594181
C  -2.287487 1.075806 0.299928
C  1.074795 -3.138749 -1.683828
C  3.959261 2.297256 1.506206
C  2.025386 -3.675058 -0.768749
C  4.573969 1.141093 2.061698
C  -2.248656 -0.249258 0.823235
C  -3.530611 1.735356 0.189158
C  -3.465077 -0.881142 1.183721
C  -4.722885 1.080554 0.562861
C  -4.711917 -0.237383 1.058222
H  1.261766 2.42244 -1.613275
H  1.026241 1.118411 -2.817478
H  -1.121734 2.850383 -0.113983
H  -0.1882 1.464997 0.553747
H  0.107191 -1.336944 -2.464906
H  2.507383 3.096319 0.091113
H  3.522323 -3.242384 0.7574
H  4.682736 -1.036661 2.052992
H  -1.100486 1.373223 -3.553985
H  -1.334173 2.939242 -2.6963
H  -2.46651 1.571792 -2.424173
H  0.482605 -3.820843 -2.304677
H  4.258596 3.289846 1.861339
H  2.156916 -4.760764 -0.703886
H  5.339054 1.257471 2.836788
H  -3.559643 2.761706 -0.189986
H  -5.634997 -0.746588 1.343498
H  -1.065407 -1.778702 1.264791
