program: Gaussian 09
title: 000259129
version: EM64L-G09RevD.01
frameworkgroup: C1[X(C9H13N5O)]
method: RPBEPBE
basis: SDD
operation: Freq
keyword: #p
keyword: freq=noraman
keyword: PBEPBE/SDD
title: #p freq=noraman PBEPBE/SDD
converged: YES YES NO NO
title: Mulliken charges:
elementType: O N N N N N C C C C C C C C C H H H H H H H H H H H H H
charge: -0.283509 -0.041749 -0.160845 -0.402436 -0.025412 -0.503520 0.297121 0.180037 -0.353411 -0.339010 -0.358630 -0.320978 0.132349 -0.599578 -0.617514 0.272882 0.217139 0.246645 0.261309 0.233276 0.260144 0.233460 0.262034 0.260612 0.219242 0.323231 0.301261 0.305851
chargesum: 0.00000
title: Mulliken charges with hydrogens summed into heavy atoms:
elementType: O N N N N N C C C C C C C C C
charge: -0.283509 -0.041749 -0.160845 -0.079205 -0.025412 0.103591 0.297121 0.180037 -0.080529 -0.121871 -0.111985 -0.059668 0.132349 0.127302 0.124374
polarizability: 3.05706073e+02 8.20461629e+00 1.31887749e+02 -1.86865297e+00 1.87262645e+00 6.97029223e+01
1716.lowfreq: -7.7936 -0.0009 0.0004 0.0004 2.7724 6.1545 26.8161 41.5041 54.8188
frequency: 26.7761 41.4469 54.8041 75.5569 85.5130 108.6016 121.4803 144.5667 153.5683 195.4087 219.8115 241.4149 270.7792 318.3826 347.0956 374.4112 383.8712 411.0193 456.9814 482.5340 524.5976 548.2298 563.9995 632.2679 674.5257 692.8999 768.6041 791.0086 810.0387 841.8726 862.9437 873.6868 899.4710 973.0411 994.8767 1001.4690 1037.3655 1054.0602 1064.4665 1084.0829 1114.7396 1127.6070 1164.3857 1195.5631 1211.8969 1277.4478 1284.4962 1288.1349 1305.6384 1331.3530 1338.8508 1370.6834 1417.2936 1420.4100 1439.7451 1440.4786 1441.4738 1468.7251 1480.8645 1489.1306 1493.9344 1557.2495 1595.1574 1612.3815 1682.2584 2970.1638 2986.9514 3045.3016 3065.1049 3118.0162 3121.8747 3123.1338 3148.7291 3166.6150 3170.2149 3379.8186 3491.8785 3567.0826
redmass: 3.2794 4.3050 4.2365 4.4040 1.5184 2.2862 1.2929 1.8383 2.1149 2.1192 4.8824 3.0735 4.7774 4.0740 5.7920 3.0927 6.8675 3.0270 5.9714 4.0489 2.2604 1.4592 4.4539 6.6428 6.2165 3.7710 4.2197 1.7706 4.7453 1.3411 6.7458 1.6196 5.1751 1.3620 1.4198 2.6731 1.4590 3.1883 2.3788 1.2480 1.3197 1.3452 1.4500 3.2052 2.6224 2.1871 2.2928 1.3739 1.5945 4.8826 4.0637 4.7405 1.1568 3.6785 1.3577 1.0475 1.6081 1.0454 1.0925 1.2514 2.0649 7.4115 7.9899 6.2632 1.0609 1.0357 1.0336 1.1018 1.0998 1.1009 1.0889 1.0981 1.0878 1.0940 1.0967 1.0429 1.0979 1.0790
irintensity: 0.6887 0.8044 0.1326 1.4099 3.5840 12.7475 7.0777 5.1779 0.3882 14.6163 0.0788 1.3286 16.0757 22.0370 3.8405 1.0903 1.5453 1.3885 11.3474 17.6675 21.7235 147.4600 29.4857 4.2727 0.4210 14.6852 4.3925 132.0789 8.1487 8.1096 49.2564 48.3709 10.3450 0.6516 1.4187 2.2104 27.1657 7.2309 139.6720 0.1683 17.9190 0.4466 34.4118 4.0896 0.9002 127.6135 85.8020 40.9543 25.8291 46.1989 491.1228 3.6468 36.6001 5.3010 123.6708 18.4140 165.1457 12.8778 34.6040 52.8574 16.3512 73.5116 126.2740 97.0701 30.7308 95.3009 60.1899 34.4524 18.2341 10.2286 22.0097 13.3686 2.5650 9.8783 1.5801 0.3856 1.3948 30.2592
temp: 298.150 k
press: 1.00000 atm
elementType: 8 7 7 7 7 7 6 6 6 6 6 6 6 6 6 1 1 1 1 1 1 1 1 1 1 1 1 1
symmnumber: 1
zpe: 580860.6 jmol-1
zpe.correction: 0.221238 hartree
zpe.thermalcorrener: 0.237071 hartree
zpe.thermalcorrenthalpy: 0.238015 hartree
zpe.thermalcorrgfe: 0.176435 hartree
zpe.sumelectzpe: -698.550531 hartree
zpe.sumelectthermal: -698.534698 hartree
zpe.sumelectthermalent: -698.533754 hartree
zpe.sumelectthermalfe: -698.595334 hartree
dipole: -6.0070 -2.5059 0.4660
dipole: 6.5254
quadrupole: -65.3708 -86.1538 -90.2087
quadrupole: -3.3971 0.6571 2.7659
quadrupole: 15.2069 -5.5760 -9.6309 -3.3971 0.6571 2.7659
hfenergy: -698.7717695 hartree
pointgroup: C01 [X(C9H13N5O1)]
dipole: 2.3802428 -0.8695817 0.4113807 debye
polarizability: 305.5861035|-1.0729342|114.3327281|10.34638|-27.8529261|87.3779129 unknown
InChI: InChI=1S/C9H13N5O/c1-14(2)13-12-8-5-3-7(4-6-8)9(15)11-10/h3-6,11H,10H2,1-2H3
charge 0 multiplicity 1
28 atoms
O  -4.153317 1.066094 -0.519449
N  4.365331 -0.18063 0.231569
N  2.318613 0.521972 -0.326003
N  -4.026392 -1.151887 0.143311
N  3.027172 -0.384327 0.325944
N  -5.437843 -1.328999 0.147936
C  -1.935119 0.108507 -0.181112
C  0.909091 0.31471 -0.225723
C  -1.298797 1.159542 -0.890824
C  -1.127295 -0.82753 0.524194
C  0.10241 1.25989 -0.916889
C  0.274249 -0.731868 0.505915
C  -3.434619 0.066239 -0.197725
C  5.218191 -1.149952 0.923511
C  4.936808 0.944842 -0.527203
H  -1.930126 1.888237 -1.409211
H  -1.58997 -1.61691 1.129122
H  0.603658 2.064052 -1.465156
H  0.891908 -1.446916 1.05697
H  5.886061 -1.672148 0.212257
H  4.563671 -1.887856 1.411213
H  5.841747 -0.654698 1.69182
H  4.561333 1.906162 -0.132015
H  4.63228 0.890457 -1.588418
H  6.034183 0.90238 -0.444591
H  -3.483733 -2.010056 0.235978
H  -5.853466 -0.812052 0.936957
H  -5.83433 -0.980256 -0.738481
