program: Gaussian 09
title: 000259109
version: EM64L-G09RevD.01
frameworkgroup: C1[X(C5H8N2O2)]
method: RPBEPBE
basis: SDD
operation: Freq
keyword: #pfreq=noraman
keyword: PBEPBE/SDD
title: #p freq=noraman PBEPBE/SDD
converged: NO YES NO NO
title: Mulliken charges:
elementType: O O N N C C C C C H H H H H H H H
charge: -0.216549 -0.230639 -0.169028 -0.123004 -0.244004 0.237881 -0.670741 0.228162 -0.733812 0.238720 0.238692 0.217346 0.235555 0.235554 0.248267 0.259332 0.248268
chargesum: 0.00000
title: Mulliken charges with hydrogens summed into heavy atoms:
elementType: O O N N C C C C C
charge: -0.216549 -0.230639 -0.169028 -0.123004 0.233407 0.237881 0.017714 0.228162 0.022056
polarizability: 1.08848718e+02 2.31375672e+00 6.57276877e+01 2.20192503e-03 -8.23934801e-04 4.67902586e+01
1716.lowfreq: -11.1734 -7.3289 0.0008 0.0011 0.0011 7.2701 54.7900 84.2266 126.3482
frequency: 54.7873 84.2084 126.3482 134.3701 195.4427 239.2522 287.3477 328.2366 335.4291 461.0203 616.4934 647.7021 667.8328 705.6826 803.0636 842.8068 860.6049 885.9991 954.1858 1019.3575 1023.0155 1049.1475 1113.7639 1136.8397 1141.4653 1253.3138 1286.8552 1356.8830 1400.7384 1402.6879 1453.6732 1459.3767 1461.0393 1471.5640 1482.0152 1502.2307 1559.6971 3000.1044 3001.2361 3013.6114 3076.2168 3082.7309 3097.5462 3116.2952 3127.6114
redmass: 3.1816 2.0826 3.7027 1.0659 3.1440 1.2933 3.1867 3.1971 6.9313 4.8417 7.2452 5.5026 10.7386 5.6160 1.0924 6.4507 7.4607 7.1452 4.4195 2.3147 2.6449 1.4574 2.4026 1.4477 5.0392 1.1313 4.8570 1.4482 1.2357 1.2701 1.0432 1.2025 1.0394 1.1273 1.2207 2.7563 6.9519 1.0373 1.0362 1.0580 1.1079 1.0985 1.0981 1.1028 1.0986
irintensity: 0.3376 9.0942 6.3935 0.0039 0.0702 0.1720 4.4561 6.9968 3.5737 0.1728 0.0028 18.8210 6.6225 4.6938 4.3163 88.3759 10.4307 1.2700 11.5998 73.7973 2.1641 5.0500 8.3985 6.1905 80.5214 0.0354 71.0700 75.3408 0.8976 63.4616 18.6305 24.7189 13.0654 67.3557 89.8608 254.4966 62.3729 12.2507 14.0254 15.8133 7.0742 9.9287 23.3165 36.7838 3.8522
temp: 298.150 k
press: 1.00000 atm
elementType: 8 8 7 7 6 6 6 6 6 1 1 1 1 1 1 1 1
symmnumber: 1
zpe: 342848.7 jmol-1
zpe.correction: 0.130584 hartree
zpe.thermalcorrener: 0.139969 hartree
zpe.thermalcorrenthalpy: 0.140914 hartree
zpe.thermalcorrgfe: 0.095630 hartree
zpe.sumelectzpe: -454.531762 hartree
zpe.sumelectthermal: -454.522377 hartree
zpe.sumelectthermalent: -454.521433 hartree
zpe.sumelectthermalfe: -454.566716 hartree
dipole: 1.1180 -1.8822 0.0006
dipole: 2.1891
quadrupole: -35.9222 -62.2194 -51.8791
quadrupole: 7.3214 0.0003 0.0011
quadrupole: 14.0847 -12.2125 -1.8722 7.3214 0.0003 0.0011
hfenergy: -454.6623462 hartree
pointgroup: C01 [X(C5H8N2O2)]
dipole: -0.4547249 -0.7314418 -0.0038948 debye
dipolederiv: -1.955544 -0.0393235 -0.0014625 -0.1810784 -0.3763158 -0.0006859 -0.0020519 -0.0005637 -0.2577609 -0.9488633 -0.0514585 -0.0009028 0.0836588 -0.6405118 -0.0026252 -0.0002844 -0.002742 -0.0628978 -0.5806536 0.0658906 0.0000518 -0.6221629 -0.329939 -0.0009923 -0.003164 -0.0004477 -0.2201448 -0.0713798 -0.0415615 -0.0000721 0.1964609 -0.274479 -0.0000857 0.0010371 -0.000283 -0.2228388 1.1135451 -0.1116809 0.0000684 -0.4521179 0.304046 -0.0006043 -0.001496 -0.0003516 0.3501148 1.8142339 0.1271673 0.0017979 0.6719342 0.6241497 0.0024074 0.0043084 0.0020119 0.2164627 -0.178726 -0.0575131 -0.0003427 -0.0325053 0.0302535 -0.0000685 -0.0002184 -0.0000994 0.0575758 0.7163489 0.0327268 0.0006196 0.0601442 0.5346229 0.0023711 0.0007326 0.0023524 0.0409299 -0.1344996 0.0290502 -0.0000242 0.1256327 -0.0335134 -0.0004678 0.0004681 -0.000559 0.0847529 -0.0197041 -0.0276526 -0.0489502 0.0801717 0.0016032 -0.0730142 -0.0179723 -0.0968512 -0.0515934 -0.0198644 -0.0281399 0.0487384 0.0800024 0.0001995 0.0735989 0.018666 0.0973052 -0.0502294 -0.0697311 0.0929883 0.0002881 0.1153423 -0.0084815 -0.0004966 0.00038 -0.0005056 0.1219356 0.1057962 -0.0033907 0.0093956 -0.0632096 0.0243128 -0.1022082 -0.0183056 -0.1108411 -0.0564014 0.1058219 -0.0033888 -0.0092997 -0.0634169 0.0225738 0.1027889 0.0178946 0.1114732 -0.0546606 0.0471359 0.0305421 -0.0108731 0.0559763 0.0565144 -0.0945388 0.0404495 -0.1049706 -0.0166 0.0288859 -0.0445191 -0.0002985 -0.1110395 0.0103845 -0.0006973 -0.0006236 -0.0006391 0.1360575 0.0471981 0.0302633 0.011266 0.0562069 0.0545802 0.0953186 -0.0398202 0.1057113 -0.0147021 unknown
polarizability: 108.7374761|-3.1839682|65.8385097|0.0302961|0.0859005|46.7906783 unknown
InChI: InChI=1S/C5H8N2O2/c1-3-8-5-7-6-4(2)9-5/h3H2,1-2H3
charge 0 multiplicity 1
17 atoms
O  -1.446139 -0.601228 -0.004138
O  0.859647 -0.990591 -0.004249
N  0.185562 1.206059 0.005475
N  1.638796 1.164029 0.006427
C  -2.55958 0.414947 -0.000521
C  -0.203588 -0.071483 -0.000754
C  -3.860227 -0.374726 -0.004234
C  1.997096 -0.114209 0.000669
C  3.35399 -0.722133 -0.001226
H  -2.437658 1.044409 0.899283
H  -2.436878 1.051554 -0.895179
H  -4.714276 0.32688 -0.001667
H  -3.934801 -1.009992 -0.902459
H  -3.93542 -1.017271 0.888749
H  3.508843 -1.349399 -0.896723
H  4.101666 0.085708 0.003268
H  3.507465 -1.358057 0.88838
