program: Gaussian 09
title: 000259120
version: EM64L-G09RevD.01
frameworkgroup: C1[X(C12H9N7O)]
method: RPBEPBE
basis: SDD
operation: Freq
keyword: #p
keyword: freq=noraman
keyword: PBEPBE/SDD
title: #p freq=noraman PBEPBE/SDD
converged: YES YES NO NO
title: Mulliken charges:
elementType: O N N N N N N N C C C C C C C C C C C C H H H H H H H H H
charge: -0.194602 -0.123742 -0.182706 -0.017764 -0.079612 -0.332184 -0.079031 -0.047180 0.125330 -0.582820 -0.066922 0.301765 0.497640 -0.190383 -0.405223 -0.357257 0.084553 -0.220602 -0.225945 -0.228858 0.263027 0.237362 0.276443 0.353567 0.228397 0.263190 0.232878 0.234258 0.236419
chargesum: 0.00000
title: Mulliken charges with hydrogens summed into heavy atoms:
elementType: O N N N N N N N C C C C C C C C C C C C
charge: -0.194602 -0.123742 -0.182706 -0.017764 -0.079612 0.021383 -0.079031 -0.047180 0.125330 -0.082431 -0.066922 0.301765 0.497640 0.086060 -0.176827 -0.094067 0.084553 0.012276 0.008314 0.007561
polarizability: 2.88617712e+02 2.94840082e+01 1.66253518e+02 8.69398596e+00 -6.41721111e+00 1.13442153e+02
1716.lowfreq: -7.6464 -0.0009 -0.0008 -0.0005 3.7755 5.9342 14.0761 34.3786 35.8435
frequency: 11.1682 34.3684 35.8339 82.5180 148.8421 151.1999 154.7308 206.4633 253.9116 256.3029 293.9888 340.3162 347.4105 403.3004 411.4703 428.0284 453.9864 486.3298 530.4050 532.7332 556.8251 584.1666 616.3900 634.4268 645.7222 655.2348 695.5499 703.5187 712.6320 748.6751 751.1279 777.9414 814.1507 820.5116 832.7939 859.5425 864.8095 928.4371 932.8545 949.2065 984.5935 990.3944 1004.1686 1009.9853 1019.1037 1027.3551 1071.1765 1086.0731 1124.9743 1175.2254 1176.7493 1192.4845 1203.4157 1214.3677 1261.3810 1307.2440 1317.8188 1334.8689 1337.3311 1348.0044 1357.0521 1366.9058 1386.1901 1430.0756 1443.9644 1458.5497 1480.4117 1489.3574 1596.9380 1614.2545 1640.3634 1702.9128 3029.1416 3089.7430 3116.9510 3127.9757 3138.9577 3152.0217 3168.3972 3238.9770 3602.0111
redmass: 5.1053 5.8980 5.7318 8.6432 6.8529 6.7226 6.2831 6.1430 7.6272 7.2004 6.9700 3.5124 2.5929 2.8174 7.3884 1.4570 4.6767 5.4479 6.5717 7.6060 7.1484 5.7557 6.3390 4.9079 8.9246 7.6007 4.7497 11.3998 1.5656 9.8138 7.6475 2.8799 2.6100 8.4252 1.7243 1.2489 5.4793 1.6621 5.8817 1.8586 1.3873 6.2245 1.3297 8.7134 6.5912 2.2627 6.2239 1.7682 2.7430 1.5081 1.2109 1.1347 3.0002 2.7969 2.8851 3.8262 2.7974 2.5515 1.7662 2.0446 2.6521 2.6323 6.9688 6.1833 2.1927 1.5247 2.5252 2.1129 6.0776 6.0016 12.0618 10.5199 1.0595 1.1054 1.0886 1.0874 1.0910 1.0958 1.1015 1.0989 1.0826
irintensity: 0.0266 0.8024 0.4296 0.2734 7.0573 0.4711 0.4061 1.7559 12.0161 11.5833 2.0449 29.5660 14.9234 0.0971 4.2493 86.3467 6.0100 11.2106 6.4396 3.5780 2.9986 1.6810 0.1100 27.4646 10.4369 7.6031 4.0464 13.5448 112.3000 5.0128 42.4222 8.5261 13.7196 5.9548 8.6584 0.6316 33.7401 3.4216 19.9806 16.8503 0.9368 0.4465 2.4528 8.0500 265.3744 5.8093 53.0013 4.4129 1.8367 16.4815 7.0798 1.4360 16.7586 8.9239 62.9993 193.9347 45.2397 6.3282 0.6485 9.3113 49.1414 31.1140 1.6392 19.9852 11.3997 17.0068 13.5640 36.8420 1.5261 5.3713 759.0368 328.3628 22.9172 2.4166 9.4531 0.5808 6.5503 25.1097 21.8072 0.7175 132.9053
temp: 298.150 k
press: 1.00000 atm
elementType: 8 7 7 7 7 7 7 7 6 6 6 6 6 6 6 6 6 6 6 6 1 1 1 1 1 1 1 1 1
symmnumber: 1
zpe: 541105.0 jmol-1
zpe.correction: 0.206096 hartree
zpe.thermalcorrener: 0.221243 hartree
zpe.thermalcorrenthalpy: 0.222187 hartree
zpe.thermalcorrgfe: 0.161107 hartree
zpe.sumelectzpe: -919.700338 hartree
zpe.sumelectthermal: -919.685191 hartree
zpe.sumelectthermalent: -919.684246 hartree
zpe.sumelectthermalfe: -919.745326 hartree
dipole: 8.7871 -1.3475 3.2766
dipole: 9.4745
quadrupole: -135.1189 -109.3194 -118.8327
quadrupole: 16.4285 -18.5527 8.9218
quadrupole: -14.0286 11.7710 2.2576 16.4285 -18.5527 8.9218
hfenergy: -919.9064336 hartree
pointgroup: C01 [X(C12H9N7O1)]
dipole: 3.4873351 0.4640207 -1.2319941 debye
polarizability: 286.657547|-33.173733|168.8338868|-8.3450584|-4.194484|112.8219486 unknown
InChI: InChI=1S/C12H9N7O/c20-12-14-10-9-11(15-17-19(10)16-12)18(7-13-9)6-8-4-2-1-3-5-8/h1-5,7,16H,6H2
charge 0 multiplicity 1
29 atoms
O  -5.788242 0.666141 0.985884
N  0.772374 -1.115963 -0.750535
N  -2.597866 0.90819 -0.421236
N  -0.80873 -2.247906 0.476785
N  -0.463402 0.944156 -1.293444
N  -3.853588 1.423144 -0.17983
N  -3.749465 -0.645205 0.842311
N  -1.633014 1.590458 -1.157063
C  -0.356687 -0.295909 -0.702007
C  2.066189 -0.774961 -1.40149
C  -1.325382 -1.023333 0.061002
C  -2.590011 -0.384387 0.241256
C  3.065875 -0.132895 -0.445932
C  0.447744 -2.262779 -0.025857
C  4.146825 -0.88503 0.074998
C  2.920105 1.227606 -0.072376
C  -4.61369 0.471792 0.614699
C  5.069162 -0.289726 0.96553
C  3.840145 1.821786 0.818352
C  4.915669 1.064516 1.339968
H  1.82014 -0.090553 -2.231516
H  2.472338 -1.707456 -1.830112
H  1.151849 -3.080669 0.110944
H  -4.131242 2.334655 -0.542384
H  4.27396 -1.935015 -0.218072
H  2.089026 1.814434 -0.48202
H  5.903682 -0.877752 1.362488
H  3.7226 2.873197 1.102077
H  5.629839 1.527567 2.02958
