program: Gaussian 09
title: 000259184
version: EM64L-G09RevD.01
frameworkgroup: C1[X(C17H17ClN4O7)]
method: RPBEPBE
basis: SDD
operation: Freq
keyword: #p
keyword: freq=noraman
keyword: PBEPBE/SDD
title: #p freq=noraman PBEPBE/SDD
converged: YES YES NO NO
title: Mulliken charges:
elementType: Cl O O O O O O O N N N N C C C C C C C C C C C C C C C C C H H H H H H H H H H H H H H H H H
charge: -0.075237 -0.421974 -0.159552 -0.167099 -0.169193 -0.184214 -0.177402 -0.178575 -0.248726 0.003694 0.002573 0.023575 -0.352407 -0.600322 -0.516287 0.327886 0.354747 -0.618597 0.274455 0.287398 -0.040077 -0.435089 -0.536595 -0.547897 0.370477 0.461451 -0.098296 -0.392279 -0.790332 0.262984 0.234483 0.312115 0.281646 0.255134 0.231683 0.250129 0.221902 0.243548 0.262130 0.332766 0.333822 0.262418 0.212556 0.241600 0.256557 0.408423
chargesum: 0.00000
title: Mulliken charges with hydrogens summed into heavy atoms:
elementType: Cl O O O O O O O N N N N C C C C C C C C C C C C C C C C C
charge: -0.075237 -0.013551 -0.159552 -0.167099 -0.169193 -0.184214 -0.177402 -0.178575 -0.248726 0.003694 0.002573 0.023575 0.145060 -0.006561 -0.029470 0.327886 0.354747 0.096982 0.274455 0.287398 -0.040077 -0.172959 -0.203829 -0.214075 0.370477 0.461451 -0.098296 -0.129861 -0.079620
polarizability: 5.62931530e+02 -1.39237790e+01 3.02500282e+02 1.98181155e+01 -3.94496674e+00 2.19152725e+02
1716.lowfreq: -7.7440 -1.2190 0.0006 0.0016 0.0017 4.5515 7.5596 15.4813 26.9880
frequency: 6.6253 15.2984 26.9780 34.5795 42.6296 50.7544 54.4973 62.5263 88.9255 95.9070 106.8135 123.7339 134.6169 143.1949 152.6079 165.9088 176.8188 186.6314 198.8942 210.4506 218.0084 242.8475 268.0696 289.4339 303.5355 308.4491 330.7629 332.8703 347.9098 350.6134 361.3172 363.5293 398.1893 410.0821 436.4529 460.8462 483.9911 493.8248 511.8643 518.4557 540.7132 544.8262 557.7531 632.1695 640.2518 647.1905 671.8437 676.7001 706.2710 712.1395 719.0031 740.3751 741.3965 761.2546 778.1066 790.2712 841.4617 851.4944 858.1440 868.6519 877.7134 893.3957 956.3814 959.0841 961.2323 969.2824 993.2576 1011.0841 1024.9977 1030.4046 1049.8064 1077.3229 1095.0306 1097.8349 1110.3030 1130.3457 1139.8353 1172.1169 1191.2175 1197.0349 1203.7398 1204.2764 1211.1842 1213.5846 1219.8400 1253.2507 1256.4148 1280.3795 1300.1830 1313.9096 1344.0963 1357.2983 1360.5430 1367.6042 1372.1113 1381.7048 1396.8505 1401.6071 1413.3587 1416.9000 1435.0961 1437.3239 1448.8299 1453.9978 1459.2219 1466.2007 1474.2563 1478.2997 1481.7068 1497.0842 1510.4348 1584.7399 1591.6805 1601.2271 1616.6601 2464.0271 2940.7349 2942.6158 2950.5604 2981.4775 3012.1806 3046.0868 3057.2348 3058.6764 3060.5021 3095.8725 3104.2327 3125.0873 3147.2265 3157.1946 3187.3256 3188.8673
redmass: 9.5880 12.0953 8.2990 9.4640 5.5470 13.4668 15.6752 13.0585 6.4080 3.0598 1.1398 4.6677 5.7339 12.9977 5.1298 6.9335 5.8891 3.8191 4.7883 1.2511 3.0243 3.2371 2.8388 4.6876 8.4268 10.9039 4.8359 3.6551 7.0992 9.6589 5.5518 3.8973 6.1276 3.8281 4.6144 3.8035 4.8968 4.2142 3.5574 8.7139 4.5493 4.3057 3.7046 6.7112 5.4678 6.7214 11.9433 10.5810 5.3103 5.3721 6.8205 9.3343 5.6187 4.9140 2.7700 1.8682 3.5411 6.6815 6.7958 1.5334 1.3479 8.8940 1.4241 2.7363 1.6236 2.2085 2.5290 3.0757 2.0698 1.7901 1.5175 1.9866 1.6885 1.2198 2.0372 1.2157 5.6906 1.5668 5.2304 5.2760 3.0920 2.6614 3.2667 6.2033 1.9077 1.4744 1.4861 2.4428 1.2635 1.3258 1.6245 1.9619 5.7825 2.1212 5.6955 6.3829 8.5715 1.3070 2.8787 5.0568 1.4908 1.6726 3.9429 1.0484 1.1596 1.0979 1.0657 1.2136 1.0740 1.3701 1.2802 8.9593 5.7464 7.9078 3.7060 1.0719 1.0643 1.0515 1.0590 1.0370 1.0995 1.0934 1.0845 1.0637 1.0964 1.1003 1.1018 1.1019 1.0927 1.0927 1.0925 1.0934
irintensity: 0.2607 0.1373 0.1542 0.0823 0.5975 0.2925 0.0043 0.5947 6.2638 2.0332 0.3447 3.9388 2.8849 1.9950 1.5711 4.5204 0.9858 4.7524 1.6997 0.4820 0.7354 0.6718 2.1223 2.8182 0.1269 0.0838 0.6591 0.4338 2.5123 0.5123 12.3235 7.5286 1.5737 12.2727 1.1191 0.5224 4.9627 3.6798 5.3638 2.4646 0.4046 12.9349 3.9784 4.2292 5.8742 4.3867 25.4253 17.7165 6.4015 30.1931 3.3206 1.5213 4.9381 5.1159 9.9562 9.2573 29.0753 7.9072 27.1359 13.2380 15.7231 15.7710 3.0759 2.2245 26.6535 9.8560 12.9010 26.5322 6.8457 9.4259 3.3263 47.7667 11.6999 94.8757 9.2424 58.8764 4.7612 30.6052 251.2886 154.7127 58.8383 145.5713 257.0186 378.8911 72.0865 21.2506 8.2149 56.9728 16.2695 16.9856 5.0624 7.0135 59.9546 21.8237 133.0294 36.0467 17.0087 21.4653 20.6416 28.0487 14.3470 69.7183 42.1155 14.3242 14.4945 6.8059 17.2007 43.9185 12.8112 23.6010 53.6376 30.0064 62.9928 69.2301 14.6740 460.6930 12.6686 16.8980 85.3396 21.9812 13.0466 5.1715 15.6227 13.8662 18.8787 24.2577 16.3931 11.1890 4.5230 7.5100 21.5486 26.3639
temp: 298.150 k
press: 1.00000 atm
elementType: 17 8 8 8 8 8 8 8 7 7 7 7 6 6 6 6 6 6 6 6 6 6 6 6 6 6 6 6 6 1 1 1 1 1 1 1 1 1 1 1 1 1 1 1 1 1
symmnumber: 1
zpe: 867607.5 jmol-1
zpe.correction: 0.330454 hartree
zpe.thermalcorrener: 0.358158 hartree
zpe.thermalcorrenthalpy: 0.359102 hartree
zpe.thermalcorrgfe: 0.267977 hartree
zpe.sumelectzpe: -1861.251713 hartree
zpe.sumelectthermal: -1861.224010 hartree
zpe.sumelectthermalent: -1861.223065 hartree
zpe.sumelectthermalfe: -1861.314190 hartree
dipole: -0.1136 4.2813 -0.0230
dipole: 4.2829
quadrupole: -206.7477 -182.5989 -184.3452
quadrupole: 5.1017 -7.5559 -7.4912
quadrupole: -15.5171 8.6317 6.8854 5.1017 -7.5559 -7.4912
hfenergy: -1861.5821676 hartree
pointgroup: C01 [X(C17H17Cl1N4O7)]
dipole: 0.1148071 -1.6456599 -0.3434184 debye
polarizability: 559.0391934|37.3413648|304.8354039|9.897894|15.5501841|220.7099392 unknown
InChI: InChI=1S/C17H17ClN4O7/c1-10-5-12(18)6-11(17(10)23)9-19(2)4-3-14-15(21(26)27)7-13(20(24)25)8-16(14)22(28)29/h5-8,23H,3-4,9H2,1-2H3
charge 0 multiplicity 1
46 atoms
Cl 4.877636 2.018567 3.35375
O  3.01189 -0.56371 -1.751064
O  -0.311235 2.975959 -0.414352
O  -3.355865 -3.132414 0.779086
O  0.066474 1.644141 -2.229259
O  -2.184553 -3.253872 -1.171544
O  -5.058041 2.918896 0.811255
O  -6.040845 0.896031 1.219009
N  1.767633 -2.328678 -0.330566
N  -0.542408 1.930372 -1.130848
N  -2.726253 -2.590645 -0.206896
N  -5.065862 1.631034 0.808593
C  0.532058 -1.611364 0.095725
C  -0.259467 -1.103681 -1.153007
C  2.911382 -2.150879 0.639994
C  -1.52967 -0.394575 -0.731381
C  3.390469 -0.707166 0.661501
C  1.520414 -3.757519 -0.659308
C  -1.641271 1.026708 -0.662393
C  -2.671497 -1.095461 -0.231768
C  3.445629 0.024841 -0.564428
C  3.819602 -0.092112 1.859522
C  -2.766812 1.703769 -0.158725
C  -3.821816 -0.464694 0.275296
C  3.924112 1.366178 -0.605046
C  -3.854202 0.938204 0.291128
C  4.309614 1.224146 1.807353
C  4.365199 1.954152 0.602719
C  3.92245 2.118996 -1.916225
H  0.831914 -0.74611 0.713498
H  -0.101735 -2.272223 0.726362
H  0.391644 -0.432629 -1.729873
H  -0.517376 -1.960255 -1.794139
H  3.721226 -2.814028 0.275761
H  2.633679 -2.494372 1.659582
H  0.669878 -3.842971 -1.355596
H  1.285476 -4.356787 0.246916
H  2.412766 -4.184909 -1.147167
H  3.780613 -0.634487 2.809977
H  -2.796587 2.795606 -0.112919
H  -4.665805 -1.046904 0.654101
H  4.737376 2.983291 0.601144
H  4.319545 3.140547 -1.793927
H  4.52477 1.590401 -2.677206
H  2.895665 2.182788 -2.323422
H  2.466486 -1.418086 -1.455809
