program: Gaussian 09
title: 000259115
version: EM64L-G09RevD.01
frameworkgroup: C1[X(C11H11N7)]
method: RPBEPBE
basis: SDD
operation: Freq
keyword: #pfreq=noraman
keyword: PBEPBE/SDD
title: #p freq=noraman PBEPBE/SDD
converged: YES YES NO NO
title: Mulliken charges:
elementType: N N N N N N N C C C C C C C C C C C H H H H H H H H H H H
charge: -0.161571 -0.110602 -0.630627 -0.096642 -0.167889 -0.369211 -0.010172 -0.582848 0.263193 0.491008 0.039641 -0.206156 0.026151 -0.356132 -0.398365 -0.229313 -0.228014 -0.237609 0.270936 0.225325 0.258769 0.224813 0.264156 0.226239 0.228074 0.321107 0.362711 0.229035 0.353994
chargesum: 0.00000
title: Mulliken charges with hydrogens summed into heavy atoms:
elementType: N N N N N N N C C C C C C C C C C C
charge: -0.161571 -0.110602 0.053191 -0.096642 -0.167889 -0.015217 -0.010172 -0.086587 0.263193 0.491008 0.039641 0.052613 0.026151 -0.131320 -0.134208 -0.003074 0.000060 -0.008574
polarizability: 1.72842511e+02 -6.59117694e-01 2.05530885e+02 -4.52576859e+00 2.97265486e+00 1.09404671e+02
1716.lowfreq: -0.0009 -0.0006 0.0002 3.3011 6.5612 8.2308 12.8518 39.5245 52.3491
frequency: 12.7231 39.5244 52.3453 89.6138 124.8734 128.4220 158.8940 206.5796 241.1425 312.2692 342.2048 345.8000 352.9174 402.4800 419.5666 428.0962 456.4982 518.0354 538.4264 567.9026 595.0258 612.8680 618.6221 658.0285 687.0516 700.8344 704.4740 739.7528 750.0037 788.2577 794.9707 813.8642 852.5383 911.6346 919.3623 955.3411 958.7928 976.1690 977.9767 990.5542 997.4192 1001.9441 1027.0922 1053.3999 1076.7441 1087.8046 1094.9507 1144.3926 1172.8463 1183.0609 1191.3671 1201.3266 1208.9810 1212.2774 1317.5490 1326.8235 1351.0673 1357.8876 1379.9741 1394.4008 1401.7397 1434.7943 1448.0908 1472.1484 1487.1780 1553.2800 1596.3348 1606.6516 1614.6382 1634.2737 3015.8901 3094.1860 3115.2743 3127.0645 3139.8659 3151.7269 3164.7882 3229.5312 3523.2097 3613.8837 3692.1808
redmass: 4.2979 5.7243 5.3473 8.8375 6.0968 5.7278 5.6559 4.9148 5.1604 5.6594 2.5371 4.8113 4.7609 2.8064 5.0813 1.3141 3.2899 3.6656 1.1203 4.3482 4.4281 4.5057 5.0896 4.0748 1.3576 8.2886 1.8256 9.1370 2.4485 1.5174 4.7073 3.2366 1.2489 4.4312 1.6424 2.4624 4.2340 1.4882 2.8030 4.5804 1.5528 5.1421 2.2523 4.3188 3.8099 1.6099 6.8155 7.4862 1.0622 1.4203 1.1883 2.5192 4.0323 1.9132 2.1676 2.4810 2.5932 1.5484 5.0703 1.9723 2.1919 2.3964 2.1389 1.4126 1.9424 1.8192 6.0095 3.9841 6.0004 3.4879 1.0640 1.0998 1.0870 1.0866 1.0919 1.0958 1.1014 1.0981 1.0462 1.0842 1.1039
irintensity: 0.0725 1.4218 0.1215 3.3924 3.0136 1.7132 4.4873 2.7883 4.1230 8.2614 3.6832 3.2731 10.9508 0.0440 16.0502 192.2086 4.9549 10.2659 58.6232 0.6979 11.6664 30.7699 14.6416 32.3302 106.7531 4.9779 69.5330 3.9151 38.3986 22.9279 8.3111 1.9683 1.6943 7.9921 2.3299 13.6887 12.8519 4.1839 14.5535 0.1882 0.4088 2.8451 6.4928 10.6710 16.9182 5.9926 25.8063 10.6225 0.1176 7.8501 3.4637 22.4870 16.5423 44.3557 9.2919 1.2109 31.9457 21.4447 13.1904 7.1989 46.4349 43.6069 11.4512 47.9783 25.4187 5.7973 10.2394 216.3908 3.1495 457.3008 29.9054 1.1525 7.0601 1.0980 20.0566 23.3821 21.1549 2.7331 57.3144 132.6022 72.1630
temp: 298.150 k
press: 1.00000 atm
elementType: 7 7 7 7 7 7 7 6 6 6 6 6 6 6 6 6 6 6 1 1 1 1 1 1 1 1 1 1 1
symmnumber: 1
zpe: 578050.4 jmol-1
zpe.correction: 0.220168 hartree
zpe.thermalcorrener: 0.234808 hartree
zpe.thermalcorrenthalpy: 0.235752 hartree
zpe.thermalcorrgfe: 0.176361 hartree
zpe.sumelectzpe: -807.717501 hartree
zpe.sumelectthermal: -807.702861 hartree
zpe.sumelectthermalent: -807.701917 hartree
zpe.sumelectthermalfe: -807.761308 hartree
dipole: 0.6093 1.2988 -0.9993
dipole: 1.7484
quadrupole: -88.1828 -102.9382 -101.8308
quadrupole: 10.9880 -4.7686 -7.2215
quadrupole: 9.4678 -5.2876 -4.1802 10.9880 -4.7686 -7.2215
hfenergy: -807.937669 hartree
pointgroup: C01 [X(C11H11N7)]
dipole: -0.2509213 0.4776534 0.426664 debye
polarizability: 172.5016781|-0.6754833|205.5899375|-6.478944|1.7794446|109.6864517 unknown
InChI: InChI=1S/C11H11N7/c12-10-9(11-14-16-17-15-11)18(7-13-10)6-8-4-2-1-3-5-8/h1-5,7,16H,6,12H2
charge 0 multiplicity 1
29 atoms
N  -0.303693 -1.186454 -0.890598
N  -1.440282 -2.945904 0.016152
N  -3.132089 -1.73055 1.264577
N  -2.747456 1.153508 0.850785
N  -1.111415 1.838783 -0.638798
N  -2.7327 2.511704 0.636614
N  -1.767889 2.955692 -0.244525
C  0.794324 -0.4597 -1.571259
C  -1.349517 -0.63243 -0.105816
C  1.926497 -0.037528 -0.633844
C  -2.031338 -1.754232 0.442643
C  -0.410275 -2.558053 -0.77369
C  -1.705695 0.743724 0.02929
C  2.722366 -1.0118 0.02089
C  2.209462 1.334973 -0.429845
C  3.785198 -0.621542 0.863643
C  3.277059 1.727499 0.410297
C  4.067639 0.751601 1.058291
H  0.367174 0.42463 -2.069384
H  1.179027 -1.145682 -2.348733
H  0.269771 -3.240785 -1.278937
H  2.507122 -2.078511 -0.121748
H  1.57772 2.088574 -0.912372
H  4.393172 -1.382836 1.36524
H  3.486681 2.792335 0.561705
H  -3.541466 -2.611085 1.56293
H  -3.518259 -0.833051 1.55492
H  4.894348 1.055556 1.710287
H  -3.381184 3.148863 1.096583
