program: Gaussian 09
title: 000259106
version: EM64L-G09RevD.01
frameworkgroup: C1[X(C9H18N2)]
method: RPBEPBE
basis: SDD
operation: Freq
keyword: #pfreq=noraman
keyword: PBEPBE/SDD
title: #p freq=noraman PBEPBE/SDD
converged: YES YES NO NO
title: Mulliken charges:
elementType: N N C C C C C C C C C H H H H H H H H H H H H H H H H H H
charge: -0.104792 -0.106416 -0.156826 -0.430303 -0.409375 -0.392384 -0.388229 -0.382758 -0.116518 -0.599411 -0.635586 0.208336 0.187763 0.197816 0.177668 0.210195 0.205140 0.190460 0.188837 0.210434 0.184399 0.194182 0.190429 0.221479 0.223386 0.217975 0.286193 0.213542 0.214364
chargesum: 0.00000
title: Mulliken charges with hydrogens summed into heavy atoms:
elementType: N N C C C C C C C C C
charge: -0.104792 -0.106416 0.051510 -0.044723 -0.021511 0.003216 0.011042 -0.004178 0.073910 0.063428 0.078513
polarizability: 1.42090995e+02 4.72282103e+00 1.02504486e+02 -9.00653042e+00 2.57397987e-01 9.22324507e+01
1716.lowfreq: -22.5719 -11.2246 -4.1996 0.0002 0.0007 0.0010 35.3415 64.4657 72.8973
frequency: 34.3187 64.4053 72.8572 110.0802 138.5021 178.1614 195.8756 211.4595 263.5095 318.5694 336.0462 346.7219 395.9658 408.6148 466.9384 501.8104 543.5712 682.2026 767.8428 779.6665 827.2568 853.0705 861.2302 876.1649 921.9822 944.5136 949.2590 1007.2343 1042.6926 1048.7520 1059.3312 1081.1007 1089.5973 1097.1283 1109.3439 1131.4710 1142.1482 1155.5619 1235.4758 1246.3213 1256.0265 1263.8850 1293.6647 1302.2469 1326.1046 1335.4737 1344.5847 1348.5981 1351.5973 1367.9435 1392.5945 1411.3438 1439.7575 1447.7989 1457.2332 1460.1899 1462.1966 1470.0037 1475.0925 1478.1078 1486.7739 1507.7353 1650.9642 2935.5918 2936.9803 2948.2241 2957.0544 2965.7892 2970.1123 2973.3096 2976.5526 2980.2960 3001.2362 3015.3803 3018.5177 3020.8852 3031.5028 3039.5496 3050.6067 3075.4747 3098.7529
redmass: 2.6940 2.2723 1.8826 2.8975 1.0831 2.8767 2.4691 1.7472 2.5895 2.3059 2.6996 2.0350 2.2166 2.9223 1.9434 2.6402 3.2476 2.6494 1.5571 3.4648 2.2090 2.0398 2.2131 2.9891 1.4058 1.8063 2.2783 2.6361 1.4570 1.7133 1.3615 1.6120 1.7956 1.2236 1.0447 2.0418 1.3621 1.7047 1.3005 2.9743 1.4120 1.2978 1.5760 1.3803 1.3326 1.4348 1.4442 1.4802 1.4360 1.3348 3.2524 1.1496 1.1717 1.0881 1.0443 1.0860 1.0885 1.0869 1.0767 1.0935 1.0475 1.1612 5.9709 1.0763 1.0407 1.0377 1.0624 1.0689 1.0735 1.0629 1.0615 1.0685 1.0998 1.0995 1.1004 1.0956 1.1019 1.1009 1.1005 1.0964 1.0970
irintensity: 1.6209 1.3301 0.0951 0.6527 0.8140 9.3557 1.5954 0.1105 2.5576 14.2618 10.7998 0.3538 0.5915 2.7842 3.9663 3.8219 4.9732 1.2867 0.9486 0.7900 0.5992 6.7324 7.0209 9.1424 8.9374 8.3947 12.5458 25.5653 3.2298 8.7479 4.3702 23.1132 113.2348 1.5271 3.8569 5.0392 1.3714 2.9660 2.2996 15.2960 6.1729 4.0342 6.6184 51.2570 0.9725 0.5481 23.2601 12.3765 1.1377 36.4496 17.9425 30.7689 10.1835 9.8032 9.0540 6.5030 12.4199 14.1668 21.2075 4.2872 19.8650 5.1526 496.8607 59.4645 73.3610 145.9696 38.0450 24.4697 31.9444 68.9602 73.2072 47.2558 62.8352 62.8707 46.0125 63.5479 29.5500 92.4119 79.4797 30.0510 1.6705
temp: 298.150 k
press: 1.00000 atm
elementType: 7 7 6 6 6 6 6 6 6 6 6 1 1 1 1 1 1 1 1 1 1 1 1 1 1 1 1 1 1
symmnumber: 1
zpe: 680809.7 jmol-1
zpe.correction: 0.259307 hartree
zpe.thermalcorrener: 0.271762 hartree
zpe.thermalcorrenthalpy: 0.272706 hartree
zpe.thermalcorrgfe: 0.220178 hartree
zpe.sumelectzpe: -462.341174 hartree
zpe.sumelectthermal: -462.328719 hartree
zpe.sumelectthermalent: -462.327774 hartree
zpe.sumelectthermalfe: -462.380302 hartree
dipole: 1.6350 1.6768 -0.2659
dipole: 2.3570
quadrupole: -60.8397 -69.0013 -69.7280
quadrupole: 1.8881 -2.6708 1.0281
quadrupole: 5.6833 -2.4783 -3.2050 1.8881 -2.6708 1.0281
hfenergy: -462.6004803 hartree
pointgroup: C01 [X(C9H18N2)]
dipole: 0.6545923 -0.5900478 0.2885959 debye
polarizability: 141.7646953|-0.9900664|101.8255888|10.9720262|-2.1393691|93.2376479 unknown
InChI: InChI=1S/C9H18N2/c1-11(2)8-10-9-6-4-3-5-7-9/h8-9H,3-7H2,1-2H3
charge 0 multiplicity 1
29 atoms
N  0.454145 0.520957 -0.748945
N  2.620565 0.067191 0.094852
C  -0.866057 0.079535 -1.269702
C  -1.374839 -1.320733 -0.815612
C  -1.913457 1.162944 -0.891896
C  -1.735313 -1.363507 0.6901
C  -2.251015 1.134252 0.616188
C  -2.760981 -0.260969 1.051306
C  1.352035 -0.325978 -0.327115
C  3.574335 -0.897006 0.641906
C  3.007173 1.48121 0.085725
H  -0.782286 0.072085 -2.378637
H  -0.636126 -2.110386 -1.061918
H  -2.281595 -1.555084 -1.41034
H  -2.835909 0.990997 -1.484522
H  -1.509094 2.151437 -1.177435
H  -0.821515 -1.214658 1.299164
H  -2.136978 -2.362263 0.952117
H  -3.00638 1.909405 0.851434
H  -1.335788 1.387632 1.188006
H  -3.722676 -0.475532 0.538798
H  -2.967677 -0.274424 2.139523
H  1.216145 -1.424222 -0.262113
H  3.788535 -0.700672 1.713643
H  4.536977 -0.862055 0.092367
H  3.167438 -1.919727 0.555911
H  2.184638 2.048525 -0.378108
H  3.939067 1.630651 -0.495098
H  3.172935 1.859695 1.1153
