program: Gaussian 09
title: 000259167
version: EM64L-G09RevD.01
frameworkgroup: C1[X(C28H26N2O2)]
method: RPBEPBE
basis: SDD
operation: Freq
keyword: #p
keyword: freq=noraman
keyword: PBEPBE/SDD
title: #p freq=noraman PBEPBE/SDD
converged: YES YES NO NO
title: Mulliken charges:
elementType: O O N N C C C C C C C C C C C C C C C C C C C C C C C C C C C C H H H H H H H H H H H H H H H H H H H H H H H H H H
charge: -0.269691 -0.246096 -0.133352 -0.117692 0.072127 0.148940 -0.418042 -0.012076 0.320226 -0.487950 0.498359 0.137221 -0.292895 -0.304693 -0.414172 -0.498956 -0.502261 -0.492950 -0.461196 -0.393705 0.457347 0.455967 -0.445895 -0.368041 -0.370920 -0.446221 -0.221747 -0.231734 -0.229686 -0.219056 -0.246024 -0.243866 0.222375 0.273082 0.255595 0.206245 0.225685 0.201901 0.196784 0.224133 0.232145 0.200861 0.219820 0.239014 0.220575 0.200970 0.242363 0.252364 0.229962 0.273724 0.272780 0.230716 0.223595 0.226171 0.227378 0.225379 0.226675 0.228440
chargesum: 0.00000
title: Mulliken charges with hydrogens summed into heavy atoms:
elementType: O O N N C C C C C C C C C C C C C C C C C C C C C C C C C C C C
charge: -0.269691 -0.246096 -0.133352 -0.117692 0.072127 0.148940 0.077415 -0.012076 0.320226 -0.026111 0.498359 0.137221 0.134690 0.116224 -0.182027 -0.078275 -0.263248 -0.071405 -0.218832 -0.141341 0.457347 0.455967 -0.215932 -0.094318 -0.098140 -0.215505 0.001848 -0.005563 -0.002308 0.006323 -0.019350 -0.015427
polarizability: 3.76390006e+02 2.28448875e+01 3.35914125e+02 2.98479182e+01 8.39707043e+00 2.54971294e+02
1716.lowfreq: -4.8772 -2.1381 -0.0005 -0.0003 0.0004 6.3688 10.6288 12.6386 23.3705
frequency: 10.3247 12.4876 23.3555 30.9915 35.0235 39.5857 60.9603 77.7229 97.0318 109.3931 132.1420 144.2568 162.5532 192.8979 194.4073 196.5930 240.3414 254.6003 278.4997 282.0234 285.6350 311.1872 323.3360 334.6804 350.6921 376.2915 392.5406 406.8970 407.0891 423.7266 447.9775 467.9717 473.5697 486.1042 499.0345 511.6055 539.3068 555.5563 581.2850 587.5910 595.7139 611.7509 615.7859 617.3595 635.2366 677.9805 681.0676 705.9024 706.3626 719.3281 746.8231 747.4386 771.8570 786.0585 793.2531 800.5402 801.4295 809.0804 845.9152 860.7296 862.1527 871.1387 879.8291 912.1221 914.4279 915.3190 943.5985 946.8000 966.9828 969.4618 975.4434 981.9252 983.8057 984.8555 989.7349 990.0365 992.6709 1001.5667 1005.0701 1012.4690 1024.2882 1024.5245 1034.0786 1056.0928 1071.5125 1079.6663 1082.1956 1116.3379 1142.2957 1148.0011 1161.2227 1169.6932 1169.8177 1170.5442 1179.7468 1179.7964 1196.0993 1196.7182 1197.9581 1202.3327 1209.9263 1213.1280 1222.4559 1226.8661 1243.7810 1256.4326 1268.0878 1292.4947 1295.5619 1302.2426 1307.3343 1328.1228 1342.1908 1350.8976 1363.5051 1370.9809 1379.5538 1381.1392 1393.0150 1395.4025 1399.9569 1403.3158 1429.3276 1441.6091 1441.7517 1450.4403 1457.7534 1458.7943 1459.4374 1469.6649 1477.8800 1479.9692 1482.8004 1483.1397 1525.0811 1574.7487 1595.5236 1595.8098 1614.3076 1614.3778 1616.4490 1626.9211 2827.4105 2854.8316 2858.8531 2865.8616 2871.0573 2879.7341 2986.5558 2987.8013 3019.6467 3074.6893 3087.9320 3090.9476 3110.0842 3111.6610 3117.9100 3123.1174 3124.2383 3133.1246 3135.3228 3136.0554 3144.8982 3146.8569 3146.9049 3161.1101 3162.4133 3169.6073
redmass: 5.4548 5.4745 4.9024 5.2567 4.0730 3.7254 5.3767 5.7427 4.5245 4.1853 2.9787 3.4673 4.3853 4.2805 3.8323 3.7566 3.9430 4.1507 3.4044 3.6036 2.9946 3.6633 2.3923 2.5727 3.9902 2.9598 4.1349 2.8958 2.8637 4.5198 3.7646 3.2471 3.6313 4.5134 4.9475 6.4447 6.0347 4.7186 4.7433 4.7422 4.4373 5.3696 6.3486 6.2927 5.3617 4.5415 5.3192 2.2694 2.1678 4.5051 1.5469 1.5575 2.6965 4.5130 1.6906 4.0242 4.3008 4.9339 1.6342 1.2530 1.2610 4.1361 4.4980 2.1814 1.4970 2.0199 1.5989 3.5216 1.6672 1.7254 1.9114 1.6668 1.4654 1.3989 4.8349 5.8539 1.7890 1.5460 1.3848 2.6104 2.1911 2.1754 2.4180 2.0032 2.3967 1.5792 1.8258 2.9660 2.0551 2.1028 1.3824 1.0645 1.2780 1.1881 1.1279 1.1240 1.5026 1.8546 1.2514 1.3861 2.4400 1.7852 1.7821 2.0422 2.3631 1.6234 1.8463 1.5413 1.5600 1.5240 1.5008 1.8134 1.3469 1.8650 1.8503 1.9747 2.3354 2.5809 2.8993 2.1032 3.1121 3.5392 2.3354 2.0584 2.0759 2.5360 1.1848 1.1353 1.1988 1.1568 1.2484 1.3182 1.8373 1.7392 4.4614 8.3936 6.1609 6.1539 6.1065 6.0841 6.6711 7.4786 1.0715 1.0695 1.0696 1.0715 1.0708 1.0716 1.0870 1.0872 1.0856 1.0861 1.0924 1.0924 1.0871 1.0874 1.0867 1.0862 1.0860 1.0890 1.0913 1.0911 1.0974 1.0954 1.0958 1.1014 1.1014 1.0965
irintensity: 0.0372 0.0304 0.4435 0.2362 0.0875 0.0330 0.7198 1.7901 0.3567 1.4836 0.3780 3.6331 0.2180 0.7423 1.8821 0.5075 4.9102 7.1231 1.5972 3.2640 2.3513 0.4083 2.4425 14.5929 3.5133 10.6573 1.4755 0.3232 0.2865 8.8051 3.7599 7.0245 1.7392 4.6740 9.6757 4.3866 5.7180 3.7963 1.1543 9.7889 5.0048 3.4375 0.1611 1.1454 7.8353 0.7981 3.3325 33.9261 43.2821 8.9776 72.0771 43.6796 8.6042 4.4250 1.4554 9.3750 22.2929 20.6616 77.5993 1.0092 0.8354 51.1723 14.9202 45.2334 34.6885 33.4736 14.3934 72.9755 9.5878 9.8470 24.7569 6.1588 2.2186 0.7858 0.5427 0.2052 0.7446 23.1450 2.7671 102.7004 22.4729 9.3068 26.0264 15.5964 5.3163 11.0815 14.1972 52.8281 100.7795 111.7912 0.7275 1.1502 6.2676 11.4376 1.5999 2.4713 27.9087 73.7121 8.5548 1.2717 28.9333 69.2783 40.6882 38.5559 11.7731 8.3672 27.8006 41.7110 14.4692 0.9378 12.0063 36.5946 17.1944 35.8439 49.7391 7.4797 8.2363 20.0185 4.1902 1.5853 35.3204 2.8102 30.4382 21.9660 7.5834 28.0791 19.5369 9.2132 22.8177 14.8648 6.7505 13.8742 9.3460 14.1230 35.6537 26.0488 1.1021 0.5674 13.1040 2.9663 29.6056 18.8455 64.6853 52.2738 41.8246 146.2463 159.7152 102.3069 23.5279 17.0567 13.1565 6.6540 39.8190 23.9159 8.8980 9.2274 5.1467 0.5733 0.1546 6.6172 18.7918 13.7649 30.0827 26.8882 34.5067 27.3610 29.3510 13.2094
temp: 298.150 k
press: 1.00000 atm
elementType: 8 8 7 7 6 6 6 6 6 6 6 6 6 6 6 6 6 6 6 6 6 6 6 6 6 6 6 6 6 6 6 6 1 1 1 1 1 1 1 1 1 1 1 1 1 1 1 1 1 1 1 1 1 1 1 1 1 1
symmnumber: 1
zpe: 1232991.1 jmol-1
zpe.correction: 0.469622 hartree
zpe.thermalcorrener: 0.495838 hartree
zpe.thermalcorrenthalpy: 0.496783 hartree
zpe.thermalcorrgfe: 0.409460 hartree
zpe.sumelectzpe: -1340.247976 hartree
zpe.sumelectthermal: -1340.221759 hartree
zpe.sumelectthermalent: -1340.220815 hartree
zpe.sumelectthermalfe: -1340.308137 hartree
dipole: -2.3366 -2.6638 -0.2631
dipole: 3.5531
quadrupole: -180.7157 -177.4988 -176.0101
quadrupole: -2.6719 9.0379 0.8211
quadrupole: -2.6408 0.5760 2.0648 -2.6719 9.0379 0.8211
hfenergy: -1340.7175971 hartree
pointgroup: C01 [X(C28H26N2O2)]
dipole: -1.0175518 -0.9509854 -0.1198219 debye
polarizability: 379.8881758|18.1393926|331.7288065|31.8766904|6.0870384|255.6584422 unknown
InChI: InChI=1S/C28H26N2O2/c1-3-7-21(8-4-1)15-29-17-24-12-11-23-13-14-26-25(27(23)28(24)32-20-29)18-30(19-31-26)16-22-9-5-2-6-10-22/h1-14H,15-20H2
charge 0 multiplicity 1
58 atoms
O  -0.35813 -0.325267 -0.066148
O  4.135012 2.081203 1.357184
N  3.553182 -0.237054 1.307041
N  -2.692635 -0.614306 -0.564313
C  0.747886 1.843416 -0.294178
C  1.939813 1.408589 0.406248
C  2.151771 -0.029708 0.884882
C  -0.411112 1.008597 -0.537458
C  -1.558477 1.481729 -1.200561
C  -2.807087 0.621156 -1.359926
C  0.67803 3.20265 -0.805495
C  2.965853 2.354918 0.617349
C  -1.37377 -1.202433 -0.690584
C  4.034466 0.836313 2.149339
C  -1.573435 2.817562 -1.702396
C  3.893334 -1.611426 1.705921
C  -0.481788 3.657414 -1.512386
C  -3.849208 -1.522694 -0.608705
C  1.783077 4.092775 -0.602697
C  2.905021 3.684288 0.102586
C  3.912024 -2.590292 0.530043
C  -5.07966 -0.95059 0.097659
C  3.539903 -3.943367 0.720357
C  4.348953 -2.170612 -0.750907
C  -4.936735 -0.162645 1.266771
C  -6.379915 -1.240394 -0.382373
C  3.613761 -4.867967 -0.347133
C  4.418893 -3.090586 -1.820005
C  -6.075788 0.321021 1.946982
C  -7.522335 -0.761749 0.300049
C  4.054981 -4.443891 -1.621746
C  -7.373302 0.020433 1.468269
H  1.431945 -0.281358 1.701287
H  1.932666 -0.728514 0.063247
H  -3.687921 1.186865 -1.00384
H  -2.985361 0.400286 -2.445327
H  -1.31776 -2.15688 -0.144953
H  -1.048912 -1.345453 -1.751486
H  3.357226 1.069096 3.009345
H  5.052345 0.62792 2.513578
H  -2.468619 3.17672 -2.224391
H  3.202985 -2.009653 2.49117
H  4.904501 -1.58182 2.161492
H  -0.496685 4.685839 -1.89005
H  -3.548564 -2.463404 -0.103616
H  -4.13187 -1.799924 -1.655074
H  1.720061 5.110439 -1.004057
H  3.752625 4.349421 0.291454
H  3.189735 -4.275875 1.706308
H  4.617478 -1.117295 -0.890522
H  -3.925294 0.070541 1.618929
H  -6.501015 -1.839999 -1.293932
H  3.323796 -5.912748 -0.18629
H  4.757114 -2.753982 -2.806834
H  -5.953281 0.931934 2.848709
H  -8.523386 -0.992563 -0.081822
H  4.110853 -5.157849 -2.451415
H  -8.257044 0.396175 1.996218
