program: Gaussian 09
title: 000259209
version: EM64L-G09RevD.01
frameworkgroup: C1[X(C23H26O4)]
method: RPBEPBE
basis: SDD
operation: Freq
keyword: #pfreq=noraman
keyword: PBEPBE/SDD
title: #p freq=noraman PBEPBE/SDD
converged: YES YES NO NO
title: Mulliken charges:
elementType: O O O O C C C C C C C C C C C C C C C C C C C C C C C H H H H H H H H H H H H H H H H H H H H H H H H H H
charge: -0.280424 -0.280448 -0.228581 -0.228460 0.339099 -0.537495 0.046621 -0.543063 -0.385149 0.293897 0.294733 -0.714941 -0.696428 -0.396006 -0.391138 -0.378574 -0.379763 -0.343485 -0.345659 -0.398927 -0.399174 0.345325 0.344887 0.257970 0.257844 -0.750273 -0.750281 0.203803 0.239475 0.214405 0.248369 0.212752 0.205105 0.218676 0.224128 0.221202 0.219579 0.216637 0.208128 0.251854 0.250599 0.252447 0.252010 0.300478 0.300705 0.253219 0.253213 0.252088 0.246229 0.252242 0.252084 0.246255 0.252210
chargesum: 0.00000
title: Mulliken charges with hydrogens summed into heavy atoms:
elementType: O O O O C C C C C C C C C C C C C C C C C C C C C C C
charge: -0.280424 -0.280448 -0.228581 -0.228460 0.339099 -0.094217 0.046621 -0.080290 0.032708 0.293897 0.294733 -0.050934 -0.052084 -0.144152 -0.140538 -0.126127 -0.127752 -0.043007 -0.044954 -0.145708 -0.145961 0.345325 0.344887 0.257970 0.257844 0.000286 0.000268
polarizability: 3.79960053e+02 -1.11081502e+00 2.98725771e+02 1.81649138e+01 2.99043576e+00 1.91411071e+02
1716.lowfreq: -10.2559 -5.4488 -4.0178 -0.0007 -0.0002 0.0006 19.5070 20.9120 25.6656
frequency: 19.4153 20.8769 24.7368 30.1537 35.4483 42.5635 48.3815 56.1837 67.1458 71.7944 81.0117 85.1380 94.7497 96.3664 112.0469 122.4677 153.5561 178.1196 191.0305 197.6443 212.3931 228.6841 230.5525 254.4655 283.9585 289.3323 322.5367 326.3470 356.2430 361.9393 366.4894 391.1520 401.5835 412.9625 416.2622 493.3804 507.5498 532.4678 538.9120 551.2496 555.5544 557.6048 597.8717 617.9466 627.5687 650.5138 668.0288 679.2729 731.1266 741.4860 745.5392 750.0411 756.5286 794.9826 819.9100 839.3160 844.6580 857.8595 862.6086 878.5522 887.0181 887.1912 891.6492 926.9612 965.7113 968.0078 981.6362 983.3584 987.3853 994.4183 994.8983 1009.0400 1011.5979 1036.6469 1039.1122 1039.3504 1046.9985 1066.2756 1096.6932 1097.4442 1113.4948 1114.4221 1149.1196 1152.3515 1179.1695 1180.1115 1188.1311 1198.4487 1199.8488 1214.4791 1238.0278 1264.8948 1278.4972 1287.8390 1297.4302 1300.0829 1309.5015 1326.8094 1340.9291 1356.3641 1360.9806 1380.7737 1383.1899 1383.3096 1389.9975 1407.5610 1408.1281 1452.1088 1452.3397 1454.0226 1454.1200 1459.5290 1470.6815 1473.2574 1476.8044 1478.1874 1482.6786 1483.5482 1487.1308 1490.7746 1570.5154 1571.1370 1604.4758 1607.0836 1610.9523 1655.2926 1655.8325 2961.8552 2971.6782 2973.5462 2979.6282 2981.1649 3008.0581 3008.2877 3025.3708 3056.8154 3057.1568 3071.1506 3075.4652 3076.8293 3083.9908 3095.9882 3096.3604 3138.4889 3139.3384 3140.5740 3141.2673 3144.5744 3144.6048 3167.4618 3167.7665 3208.1424 3208.7249
redmass: 7.1659 7.5069 3.3682 4.1416 3.8853 3.7422 2.5593 3.1919 1.8291 2.0451 1.6306 1.7607 1.8753 2.8823 3.4041 6.2229 3.2321 6.0486 1.8269 4.7014 2.4519 2.2663 1.4149 3.8125 3.4258 2.8045 3.8325 3.4001 4.0962 4.5651 4.0359 4.6385 3.7346 3.0261 3.0536 4.1831 3.4959 3.3045 3.5558 3.3969 3.1509 3.2088 3.3768 5.7496 5.6211 6.4590 3.9595 6.1944 4.0982 2.6594 4.6353 1.4120 5.2281 1.3346 2.2114 1.3689 1.2913 1.5415 1.4748 1.7201 6.7652 6.7922 2.4441 2.6114 1.3469 1.3703 1.3405 1.3301 2.0021 1.9546 1.9393 2.8008 2.5194 2.3895 1.6395 1.6384 2.3949 1.7975 1.8128 1.8470 1.3472 1.3582 2.3891 2.3899 3.5514 3.5439 2.9073 1.4126 1.4747 2.5470 1.4608 1.3567 1.2641 2.0818 1.1910 1.2782 1.8143 1.3650 1.4676 6.0041 4.9627 1.2110 1.2355 1.2386 1.2131 3.5592 3.6644 1.0613 1.0613 1.0466 1.0467 1.0755 1.0747 1.0530 1.0441 1.0531 1.1294 2.0818 2.5887 1.0933 7.3494 7.3422 7.8743 6.3969 6.8341 9.5886 9.5760 1.0656 1.0634 1.0392 1.0413 1.0541 1.0367 1.0367 1.0981 1.0935 1.0953 1.1001 1.0998 1.0995 1.0990 1.0974 1.0974 1.0896 1.0900 1.0901 1.0895 1.1011 1.1011 1.0962 1.0963 1.0941 1.0941
irintensity: 0.3113 1.8363 0.7710 2.5037 0.2719 2.4845 0.8555 0.8300 0.6795 0.6996 0.0895 0.3722 0.1014 0.4443 0.6782 0.1091 2.8120 1.2004 1.0751 5.8917 0.0915 0.7761 0.2016 0.5380 0.3361 0.9377 1.9705 0.8286 0.3825 2.7213 0.4199 1.5428 5.5174 1.4273 0.8580 14.0710 12.0500 9.1022 5.8717 2.5289 0.1228 0.2163 5.1210 5.0640 0.3465 6.1436 24.6674 12.6365 0.2154 11.0164 15.2670 3.6098 1.6253 3.6284 32.8333 22.7267 2.1739 57.4059 29.2489 1.0319 96.1188 14.8931 13.8237 12.3090 2.1145 0.6710 1.2207 0.8113 3.9992 175.8805 30.9855 18.6863 71.0626 2.4251 8.9870 8.7390 1.2683 5.8686 33.4888 9.4562 20.9784 2.0328 514.6963 70.2733 821.1007 78.5367 56.3443 83.9865 41.1352 24.5679 5.9710 7.4774 2.1530 2.4321 2.7102 1.1298 6.0714 0.4378 4.4707 20.8679 2.3040 12.6689 63.0725 57.5725 9.7102 7.8449 11.0597 24.4834 25.5837 18.5385 18.5909 3.7144 11.8862 1.9745 12.7481 7.2057 25.8147 42.0114 175.5821 3.7739 6.0489 6.8315 14.3503 9.1694 8.4593 355.0654 59.5014 12.5256 20.4312 39.4320 43.4611 49.7283 1.8953 1.8933 6.0745 2.2417 8.3848 63.5925 73.3886 32.9578 55.5650 6.8506 6.8133 7.6671 10.7275 9.8625 9.6530 14.8752 7.5527 5.6059 5.5868 2.9889 2.9062
temp: 298.150 k
press: 1.00000 atm
elementType: 8 8 8 8 6 6 6 6 6 6 6 6 6 6 6 6 6 6 6 6 6 6 6 6 6 6 6 1 1 1 1 1 1 1 1 1 1 1 1 1 1 1 1 1 1 1 1 1 1 1 1 1 1
symmnumber: 1
zpe: 1128164.1 jmol-1
zpe.correction: 0.429695 hartree
zpe.thermalcorrener: 0.458245 hartree
zpe.thermalcorrenthalpy: 0.459189 hartree
zpe.thermalcorrgfe: 0.365767 hartree
zpe.sumelectzpe: -1190.965262 hartree
zpe.sumelectthermal: -1190.936712 hartree
zpe.sumelectthermalent: -1190.935768 hartree
zpe.sumelectthermalfe: -1191.029190 hartree
dipole: -0.0657 -1.3706 -0.1732
dipole: 1.3830
quadrupole: -159.1165 -139.8047 -160.9746
quadrupole: 2.3791 -15.7313 2.1996
quadrupole: -5.8179 13.4939 -7.6760 2.3791 -15.7313 2.1996
hfenergy: -1191.3949571 hartree
pointgroup: C01 [X(C23H26O4)]
dipole: 0.01969 0.5397425 -0.066036 debye
polarizability: 374.573087|-1.2070132|298.7679696|-36.2910531|-2.0069706|196.7558387 unknown
InChI: InChI=1S/C23H26O4/c1-5-7-18(6-2)23(19-8-12-21(13-9-19)26-16(3)24)20-10-14-22(15-11-20)27-17(4)25/h8-15H,5-7H2,1-4H3
charge 0 multiplicity 1
53 atoms
O  4.945782 1.984567 -0.119173
O  -4.522398 2.495632 -0.058424
O  6.234494 0.904006 -1.772556
O  -5.86936 1.831393 1.760206
C  -0.03756 -2.41325 0.231258
C  -1.356651 -3.173469 0.109343
C  0.036337 -1.036424 0.127043
C  1.194438 -3.283206 0.480419
C  -1.332687 -4.281823 -0.98235
C  1.339425 -0.293639 0.037761
C  -1.181803 -0.156643 0.101898
C  1.051837 -4.192083 1.731576
C  -2.711416 -4.957494 -1.141862
C  2.342666 -0.649517 -0.902912
C  -2.196232 -0.260143 1.090789
C  1.585007 0.837205 0.867031
C  -1.326517 0.856686 -0.887216
C  3.56058 0.057824 -1.011365
C  -3.329813 0.5823 1.100872
C  2.792938 1.552884 0.784388
C  -2.450315 1.702603 -0.904192
C  3.777153 1.158855 -0.150526
C  -3.4480 1.561252 0.08711
C  6.092951 1.805475 -0.921294
C  -5.657986 2.569289 0.776265
C  7.100784 2.879277 -0.574276
C  -6.556846 3.679277 0.277102
H  -1.620872 -3.650934 1.076225
H  -2.179447 -2.477798 -0.128659
H  1.394652 -3.927801 -0.399892
H  2.086941 -2.649567 0.61168
H  -1.022549 -3.833164 -1.946999
H  -0.575539 -5.050061 -0.732022
H  0.238627 -4.931887 1.622135
H  0.846193 -3.58954 2.635172
H  1.99041 -4.750522 1.901958
H  -2.685114 -5.746968 -1.915189
H  -3.483106 -4.221385 -1.435185
H  -3.037435 -5.423927 -0.192724
H  2.159505 -1.488799 -1.58291
H  -2.088089 -1.004804 1.887264
H  0.821782 1.149927 1.587637
H  -0.551138 0.975383 -1.651729
H  4.314137 -0.232847 -1.743373
H  -4.092943 0.486545 1.873306
H  2.99019 2.414125 1.429806
H  -2.570592 2.474388 -1.67046
H  6.668523 3.878751 -0.754885
H  8.004164 2.747495 -1.186573
H  7.361944 2.82426 0.496674
H  -6.011595 4.638871 0.274956
H  -7.44251 3.754149 0.92394
H  -6.868451 3.477281 -0.762369
