program: Gaussian 09
title: 000259162
version: EM64L-G09RevD.01
frameworkgroup: C1[X(C20H24Cl2N2O2)]
method: RPBEPBE
basis: SDD
operation: Freq
keyword: #p
keyword: freq=noraman
keyword: PBEPBE/SDD
title: #p freq=noraman PBEPBE/SDD
converged: YES YES NO NO
title: Mulliken charges:
elementType: Cl Cl O O N N C C C C C C C C C C C C C C C C C C C C H H H H H H H H H H H H H H H H H H H H H H H H
charge: -0.095828 -0.095820 -0.280309 -0.280352 -0.075761 -0.075748 0.144909 0.116567 0.116715 -0.468769 -0.468895 0.447473 0.176264 0.176213 -0.368650 -0.368582 -0.397697 -0.397678 -0.451778 -0.451805 -0.421919 -0.421925 -0.313639 -0.313641 -0.652078 -0.652041 0.233796 0.235185 0.233860 0.235115 0.241476 0.231764 0.241452 0.231760 0.248295 0.227315 0.248311 0.227288 0.244963 0.244965 0.258323 0.258341 0.285394 0.285370 0.222622 0.239687 0.268597 0.222648 0.239674 0.268573
chargesum: 0.00000
title: Mulliken charges with hydrogens summed into heavy atoms:
elementType: Cl Cl O O N N C C C C C C C C C C C C C C C C C C C C
charge: -0.095828 -0.095820 -0.280309 -0.280352 -0.075761 -0.075748 0.144909 0.116567 0.116715 0.000213 0.000081 0.447473 0.176264 0.176213 0.104590 0.104630 0.077913 0.077921 -0.206815 -0.206840 -0.163597 -0.163584 -0.028245 -0.028270 0.078828 0.078854
polarizability: 3.01265862e+02 1.81017217e-01 2.50636780e+02 4.14578261e+01 -3.99773361e-02 2.32584914e+02
1716.lowfreq: -15.2110 -11.6094 -5.1208 -2.5475 -0.0018 -0.0015 0.0017 20.4893 23.6972
frequency: -10.9267 20.4288 23.6433 32.4512 42.8442 55.1337 87.3708 103.7464 104.9504 140.0475 147.0165 164.7272 187.7712 203.1874 213.1617 238.3772 250.7787 255.8216 262.1369 270.1609 292.7331 328.0369 333.4361 334.1630 358.5424 371.0281 378.1166 404.7787 414.1517 421.4491 429.4478 441.5496 443.1162 460.6943 467.5344 503.1086 525.7986 559.9362 586.0027 594.1370 619.3421 620.0023 649.3241 658.1665 668.2594 713.6709 729.1980 772.2107 778.5785 802.0108 817.9018 834.4788 847.3787 854.6072 856.0835 870.9017 883.1055 914.1471 917.7922 947.3884 953.8004 956.7324 974.5804 987.1818 1004.6697 1005.5429 1007.7205 1026.6201 1057.8229 1071.6360 1091.0281 1115.1852 1126.1245 1126.3783 1150.8306 1152.4531 1166.8152 1169.2838 1184.2803 1186.3261 1200.4051 1207.4695 1213.1121 1222.6188 1225.6021 1233.2976 1245.0571 1283.7792 1292.7542 1319.9678 1320.4731 1338.4353 1342.8099 1343.6471 1351.4271 1353.7808 1357.3818 1360.6482 1379.6678 1389.8874 1391.4754 1395.0661 1397.0170 1400.2176 1419.9453 1439.9835 1445.5977 1448.8045 1449.7098 1458.1761 1462.5654 1471.5939 1471.9803 1475.7893 1476.3586 1488.6589 1519.4027 1562.7729 1615.5599 1620.7620 2939.5562 2943.9278 2983.1612 2983.2226 2990.7462 2990.8168 2999.5590 2999.8009 3056.5039 3056.5168 3070.2711 3070.3729 3078.2624 3080.7413 3082.2452 3082.9447 3103.6106 3103.7504 3118.7022 3118.8239 3130.4061 3133.6295 3171.7515 3172.4626
redmass: 9.7211 8.3980 9.4382 5.8572 3.8679 4.0567 5.0569 2.5800 3.0102 7.1197 3.8563 5.5983 4.5579 4.4525 3.3750 3.0753 1.2168 1.2131 2.5701 3.6098 4.9449 3.1759 3.3023 4.0153 4.4105 5.6530 3.1221 4.8347 1.9333 4.3842 1.8850 2.5381 2.6875 7.7092 4.2376 3.7826 4.5581 4.2982 7.1493 5.0696 4.0785 3.9439 4.8174 5.2909 3.8862 5.3169 8.2931 4.7957 4.6458 1.4239 8.2926 7.1542 1.5711 2.9422 2.9326 3.4284 2.9292 1.5204 1.6373 2.3295 1.3565 3.1644 1.4061 1.7973 1.7312 1.5210 1.8162 2.3364 3.5814 2.2640 1.9602 2.4516 2.2396 2.2364 1.5672 1.4938 1.6010 1.5577 1.6882 1.5010 1.6446 1.4196 1.6513 1.9830 1.4751 1.5079 1.4797 1.6722 1.5207 2.0182 1.5975 1.4809 1.2954 1.9364 1.3089 1.3179 1.2917 1.2120 4.5605 1.7662 3.1671 1.3111 1.2588 1.5270 3.2205 2.1830 1.1307 1.1181 1.1045 1.1250 1.1649 1.0564 1.0654 1.0449 1.0448 1.1004 4.7707 8.1357 7.0759 6.9025 1.0688 1.0708 1.0368 1.0368 1.0653 1.0653 1.0611 1.0612 1.0964 1.0963 1.0973 1.0976 1.0909 1.0947 1.0959 1.0950 1.0996 1.0996 1.1018 1.1018 1.0897 1.0887 1.0965 1.0965
irintensity: 0.4105 0.7423 0.0020 0.2270 0.0318 1.3534 0.5241 0.7014 0.7583 13.2804 0.7023 1.3952 2.0258 6.0906 0.7315 3.0815 0.0141 0.1889 0.6854 11.2248 4.9258 5.7839 31.0121 0.1731 1.4610 0.5788 0.0883 8.7863 0.0360 30.3511 1.3145 0.3906 2.6111 13.0792 0.4480 1.1284 2.7069 5.8944 3.0690 3.6869 79.0309 3.4971 38.6642 6.3850 5.1466 0.7174 1.7538 11.5936 25.5213 3.8809 189.3175 107.5953 84.4597 25.3402 31.6751 0.4768 50.9752 11.5568 12.9580 3.6928 2.0664 14.1135 1.5966 8.3298 5.1772 61.0068 38.3744 35.6235 11.5968 35.6717 1.0414 94.0162 17.3660 6.9894 23.4098 158.7598 101.1002 84.4177 4.1855 4.8832 45.6271 1.2911 13.1724 102.4529 3.4455 6.0285 5.7098 0.0890 3.7153 4.4495 20.5629 2.9574 16.0726 0.0416 7.6844 7.0281 11.3437 1.4718 101.7271 1.3055 4.3374 61.5999 10.9360 35.2886 23.2858 26.4680 57.0190 0.4711 17.6852 36.9670 0.0572 2.7946 12.6365 9.1545 10.4595 13.0955 72.5555 0.6501 148.5335 19.2931 71.4611 26.0342 28.9624 10.3503 96.5348 36.7308 23.7220 55.9449 2.9923 2.3301 1.6549 14.0612 4.9048 26.8892 0.2168 26.2350 20.5732 20.5960 38.3793 14.0065 0.3003 20.3568 5.4500 9.9909
temp: 298.150 k
press: 1.00000 atm
elementType: 17 17 8 8 7 7 6 6 6 6 6 6 6 6 6 6 6 6 6 6 6 6 6 6 6 6 1 1 1 1 1 1 1 1 1 1 1 1 1 1 1 1 1 1 1 1 1 1 1 1
symmnumber: 1
zpe: 1062143.5 jmol-1
zpe.correction: 0.404549 hartree
zpe.thermalcorrener: 0.428353 hartree
zpe.thermalcorrenthalpy: 0.429297 hartree
zpe.thermalcorrgfe: 0.350162 hartree
zpe.sumelectzpe: -1954.645531 hartree
zpe.sumelectthermal: -1954.621727 hartree
zpe.sumelectthermalent: -1954.620783 hartree
zpe.sumelectthermalfe: -1954.699918 hartree
dipole: 0.0020 -0.1916 0.0015
dipole: 0.1916
quadrupole: -182.1129 -161.9221 -177.8317
quadrupole: 0.1051 22.6448 -0.0796
quadrupole: -8.1574 12.0335 -3.8761 0.1051 22.6448 -0.0796
hfenergy: -1955.0500796 hartree
pointgroup: C01 [X(C20H24Cl2N2O2)]
dipole: 0.075398 0.0003192 -0.0001823 debye
polarizability: 250.6396495|0.4559798|320.6942902|-0.0873904|-2.5760342|213.1536167 unknown
InChI: InChI=1S/C20H24Cl2N2O2/c1-13(21)7-23-9-16-18(25-11-23)5-3-15-4-6-19-17(20(15)16)10-24(12-26-19)8-14(2)22/h3-6,13-14H,7-12H2,1-2H3
charge 0 multiplicity 1
50 atoms
Cl 1.889386 -3.531565 4.199382
Cl 1.932405 3.501923 -4.202178
O  -0.276193 -3.695425 -0.794448
O  -0.226183 3.701588 0.79448
N  1.873925 -2.915886 0.087633
N  1.912223 2.892769 -0.089494
C  -0.667942 0.00545 0.001871
C  -0.003559 -1.272901 -0.225471
C  0.013551 1.274965 0.22791
C  1.517131 -1.49084 -0.083142
C  1.536826 1.472774 0.083608
C  -2.126315 0.015061 0.003283
C  -0.792771 -2.410518 -0.530665
C  -0.760035 2.423126 0.53353
C  1.242861 -3.744754 -0.880127
C  1.293532 3.731254 0.877944
C  2.222331 -3.40766 1.433405
C  2.265377 3.377926 -1.436471
C  -2.865282 -1.177261 -0.282131
C  -2.849021 1.217014 0.289971
C  -2.219176 -2.369183 -0.564145
C  -2.186775 2.400511 0.570007
C  1.056604 -3.471045 2.45927
C  1.099783 3.45395 -2.461544
C  0.130967 -4.679085 2.342031
C  0.188745 4.673158 -2.345444
H  2.058617 -1.110595 -0.974392
H  1.904744 -0.946056 0.791637
H  2.074166 1.086506 0.974784
H  1.916638 0.922131 -0.790902
H  1.485691 -3.405101 -1.905568
H  1.485599 -4.808776 -0.746826
H  1.533421 3.389868 1.903501
H  1.54987 4.791817 0.742653
H  3.007791 -2.745914 1.841738
H  2.667719 -4.415709 1.336859
H  3.042306 2.705889 -1.844373
H  2.723151 4.380584 -1.341961
H  -3.960085 -1.128453 -0.278463
H  -3.944373 1.182507 0.288693
H  -2.757664 -3.291235 -0.799603
H  -2.712606 3.329708 0.805975
H  0.499339 -2.520119 2.485394
H  0.531069 2.509782 -2.486248
H  0.70376 -5.618754 2.438386
H  -0.64249 -4.661997 3.127612
H  -0.372529 -4.667519 1.357378
H  0.772574 5.605777 -2.443869
H  -0.585621 4.664022 -3.130258
H  -0.313784 4.66919 -1.360214
