program: Gaussian 09
title: 000259095
version: EM64L-G09RevD.01
frameworkgroup: C1[X(C16H16N2O4)]
method: RPBEPBE
basis: SDD
operation: Freq
keyword: #p
keyword: freq=noraman
keyword: PBEPBE/SDD
title: #p freq=noraman PBEPBE/SDD
converged: YES YES NO NO
title: Mulliken charges:
elementType: O O O O N N C C C C C C C C C C C C C C C C H H H H H H H H H H H H H H H H
charge: -0.264105 -0.264106 -0.318856 -0.318857 -0.342104 -0.342106 0.314665 0.314668 -0.482069 -0.482068 0.351396 0.351395 -0.368280 -0.368273 0.194724 0.194725 -0.358882 -0.358882 -0.226945 -0.226948 -0.536599 -0.536599 0.296222 0.296222 0.216826 0.216819 0.245936 0.245936 0.228721 0.228721 0.356507 0.356507 0.221814 0.222145 0.248884 0.248884 0.221814 0.222145
chargesum: 0.00000
title: Mulliken charges with hydrogens summed into heavy atoms:
elementType: O O O O N N C C C C C C C C C C C C C C C C
charge: -0.264105 -0.264106 -0.318856 -0.318857 0.014403 0.014402 0.314665 0.314668 -0.185846 -0.185846 0.351396 0.351395 -0.151454 -0.151453 0.194724 0.194725 -0.112946 -0.112946 0.001776 0.001773 0.156244 0.156244
polarizability: 4.02256738e+02 -7.83587711e+00 2.00999235e+02 4.30627648e-05 1.47357655e-04 9.34160484e+01
1716.lowfreq: -4.4521 -0.7814 -0.0010 0.0006 0.0010 7.4956 8.1974 20.8940 28.2636
frequency: 8.1500 20.6775 28.2632 34.8955 79.9053 84.9439 102.7975 114.9583 139.3343 157.2694 178.8663 185.3370 201.6808 208.1960 249.6962 264.2096 265.5109 266.9276 296.4197 307.4765 375.0862 408.8714 412.7316 437.3561 443.4994 485.3240 523.3129 541.6137 542.3685 548.1154 555.7135 611.1099 612.3573 659.3741 660.1202 682.1193 690.6812 714.7559 719.8061 750.8472 785.2086 789.6955 791.7777 862.4600 873.5459 874.0978 929.5593 929.9174 940.1070 965.9790 965.9974 979.7623 979.8232 1003.7121 1005.8338 1060.9655 1091.8950 1098.4527 1099.9412 1111.5598 1111.5615 1151.3906 1155.2978 1171.5156 1187.3140 1197.2842 1199.0864 1230.2644 1255.8339 1276.7959 1292.9120 1311.5395 1393.3630 1396.9496 1403.8169 1429.0400 1429.6613 1445.3061 1451.2290 1468.7392 1468.7465 1472.8752 1473.1179 1474.2128 1481.6562 1526.8346 1531.3383 1564.3755 1588.8213 1599.5393 1620.2305 1620.4370 2960.8378 2960.9230 3049.2827 3049.2954 3128.7277 3128.7371 3132.9324 3133.0052 3151.6120 3151.6255 3170.8616 3170.8896 3174.3152 3174.3231 3496.1419 3510.1527
redmass: 4.9689 6.9008 4.9721 5.8012 3.4033 3.6869 6.3727 6.9083 4.3554 6.7480 5.4465 3.0106 1.8926 2.4805 3.5420 1.9387 1.5815 2.6078 5.8777 8.1729 6.0893 6.3502 6.3495 3.4245 3.3944 4.8613 5.1800 4.3800 5.0578 4.7140 4.0134 1.4556 1.0957 6.7153 7.2679 2.6839 1.9764 2.7631 3.0278 7.5451 3.8365 2.1772 1.7795 5.9302 1.4454 1.4570 1.5106 1.5046 4.9725 1.3398 1.3406 5.5450 5.6632 4.6571 5.0903 2.2680 1.9463 1.6082 1.7155 1.2601 1.2600 1.5719 1.3663 1.7147 1.2773 1.6337 1.4046 3.3395 2.3496 1.8587 1.3679 1.9269 4.3380 7.7042 4.4277 1.5573 1.4213 1.9135 2.0355 1.0509 1.0515 1.1569 1.4553 1.5095 2.4188 9.1868 2.4356 6.1854 6.3117 6.3876 6.6928 6.6792 1.0330 1.0330 1.1040 1.1040 1.0992 1.0992 1.0864 1.0864 1.0928 1.0928 1.0962 1.0961 1.0929 1.0929 1.0788 1.0792
irintensity: 0.0273 0.3618 4.2589 2.9147 0.4380 13.1400 0.9017 3.5673 0.1094 0.0905 15.4471 0.5118 0.1266 5.5217 0.5150 14.1122 1.9534 20.7380 1.8787 0.2761 16.0865 0.0352 4.8135 1.4580 0.7766 4.7637 27.5383 5.5823 13.6763 6.3860 18.0864 1.7312 135.8935 0.2499 0.9748 25.2522 1.1052 147.4765 1.3366 49.2908 17.2219 57.4273 4.4827 13.8402 1.2116 0.7086 45.7998 1.8798 0.7032 0.3293 0.3166 0.0572 6.9967 0.2065 217.2979 0.0131 3.1464 27.9378 0.1110 0.3950 0.0464 0.6437 1.5004 2.6222 36.9044 106.6015 0.4906 3.5925 292.7744 1.7831 12.6022 0.0496 459.6192 0.0663 414.7243 2.8427 167.2856 1.0579 457.6082 27.3956 0.4060 49.4568 0.2394 0.9549 54.5587 498.0976 0.0120 2.4151 48.9105 1.8278 2.1519 78.9940 144.0188 0.1062 4.0187 92.0333 45.9391 1.7934 13.3666 0.0075 30.7164 1.3623 20.1658 0.2958 15.5894 0.2907 0.1940 168.2146
temp: 298.150 k
press: 1.00000 atm
elementType: 8 8 8 8 7 7 6 6 6 6 6 6 6 6 6 6 6 6 6 6 6 6 1 1 1 1 1 1 1 1 1 1 1 1 1 1 1 1
symmnumber: 1
zpe: 769412.5 jmol-1
zpe.correction: 0.293054 hartree
zpe.thermalcorrener: 0.313758 hartree
zpe.thermalcorrenthalpy: 0.314703 hartree
zpe.thermalcorrgfe: 0.240240 hartree
zpe.sumelectzpe: -1028.092689 hartree
zpe.sumelectthermal: -1028.071984 hartree
zpe.sumelectthermalent: -1028.071040 hartree
zpe.sumelectthermalfe: -1028.145503 hartree
dipole: 0.0000 0.0000 -0.1552
dipole: 0.1552
quadrupole: -52.7756 -131.2957 -133.3775
quadrupole: 24.2552 0.0000 0.0003
quadrupole: 53.0406 -25.4794 -27.5612 24.2552 0.0000 0.0003
hfenergy: -1028.3857423 hartree
pointgroup: C01 [X(C16H16N2O4)]
dipole: -0.0000049 -0.0000147 0.0610636 debye
polarizability: 402.3678147|6.2476325|200.8881517|-0.0347882|0.0176199|93.4160554 unknown
InChI: InChI=1S/C16H16N2O4/c1-21-13-7-3-5-11(9-13)15(19)17-18-16(20)12-6-4-8-14(10-12)22-2/h3-10,17-18H,1-2H3
charge 0 multiplicity 1
38 atoms
O  -6.53273 -1.060648 -0.450121
O  6.530843 1.061958 -0.451265
O  -1.563962 -1.797272 0.004976
O  1.562181 1.798438 0.00523
N  -0.631636 0.29867 0.057567
N  0.629864 -0.297521 0.057368
C  -3.081045 0.130228 0.054975
C  3.079271 -0.129084 0.054205
C  -4.197984 -0.696122 -0.190673
C  4.196155 0.697348 -0.191414
C  -5.501967 -0.147949 -0.191537
C  5.500137 0.149171 -0.192761
C  -3.268302 1.517689 0.314093
C  3.266584 -1.516634 0.312799
C  -1.738249 -0.52981 0.039342
C  1.736473 0.530963 0.039111
C  -5.696248 1.234322 0.058057
C  5.694472 -1.233186 0.056311
C  -4.570427 2.052285 0.312248
C  4.568706 -2.051235 0.310473
C  -7.906558 -0.550739 -0.459358
C  7.904668 0.552049 -0.461005
H  -4.049597 -1.763717 -0.376606
H  4.047728 1.765007 -0.376946
H  -2.425653 2.178851 0.543185
H  2.423984 -2.177872 0.541854
H  -6.697253 1.675159 0.063074
H  6.695478 -1.674025 0.060949
H  -4.719489 3.118037 0.516537
H  4.717811 -3.117057 0.514359
H  -0.588974 1.322332 0.021845
H  0.587193 -1.321175 0.021397
H  -8.046614 0.216007 -1.246136
H  -8.186393 -0.129397 0.525832
H  -8.534162 -1.426348 -0.679532
H  8.532221 1.427735 -0.681018
H  8.044539 -0.214419 -1.248087
H  8.184735 0.130359 0.52397
