program: Gaussian 09
title: 000259097
version: EM64L-G09RevD.01
frameworkgroup: C1[X(C18H13FN2O2)]
method: RPBEPBE
basis: SDD
operation: Freq
keyword: #p
keyword: freq=noraman
keyword: PBEPBE/SDD
title: #p freq=noraman PBEPBE/SDD
converged: YES YES NO NO
title: Mulliken charges:
elementType: F O O N N C C C C C C C C C C C C C C C C C C H H H H H H H H H H H H H
charge: -0.174643 -0.304926 -0.271332 -0.334458 -0.321085 0.200074 0.399417 0.173790 -0.392201 -0.431078 -0.380728 -0.424888 -0.240471 0.132203 -0.249723 -0.243290 0.150913 0.171205 0.195251 -0.343872 -0.354988 -0.236414 -0.187219 0.269337 0.242839 0.272499 0.240373 0.235647 0.236689 0.233998 0.375734 0.362071 0.259042 0.261039 0.238808 0.240387
chargesum: 0.00000
title: Mulliken charges with hydrogens summed into heavy atoms:
elementType: F O O N N C C C C C C C C C C C C C C C C C C
charge: -0.174643 -0.304926 -0.271332 0.041276 0.040985 0.200074 0.399417 0.173790 -0.122865 -0.188239 -0.108230 -0.184515 -0.004824 0.132203 -0.013035 -0.009291 0.150913 0.171205 0.195251 -0.084830 -0.093948 0.002394 0.053168
polarizability: 3.45291333e+02 1.50258156e+00 2.54921630e+02 -1.83434535e+01 3.72403841e+00 9.88077972e+01
1716.lowfreq: -6.3993 -2.8287 -0.0007 -0.0006 -0.0004 2.5149 20.5523 25.2585 34.9050
frequency: 20.4735 25.0037 34.8974 48.2291 74.5538 98.3353 118.8502 135.9413 165.5876 178.5559 199.3657 227.8853 239.5825 288.9974 308.0585 335.5681 352.4675 379.4756 413.9486 432.7128 445.9587 471.8651 489.4410 507.0415 518.4752 524.5309 550.1719 572.9791 602.8039 622.5518 636.9025 646.3558 651.6891 686.9465 716.3557 753.3573 756.9265 761.9482 770.6859 787.7149 788.6567 794.0149 829.0285 841.0826 869.8113 891.1923 913.8702 940.4198 952.4314 974.8649 988.0194 994.5726 1001.3245 1006.0910 1031.1140 1033.1393 1043.5150 1072.7644 1108.3964 1133.9872 1154.3458 1173.7901 1179.7423 1187.8823 1191.9955 1218.4765 1234.3322 1237.1882 1254.8791 1272.7673 1294.7656 1367.9092 1378.8443 1392.5611 1409.7683 1411.3847 1429.8312 1440.1439 1452.8966 1477.9655 1511.5226 1516.7482 1533.2455 1572.4101 1585.2864 1591.7125 1597.4929 1617.2684 1629.8640 3125.6854 3128.9043 3138.1069 3139.2891 3150.1815 3150.2861 3155.7777 3167.7430 3168.4242 3169.8375 3181.7441 3484.8738 3499.2447
redmass: 6.1457 6.2976 6.1176 8.7314 5.6013 8.7428 5.9365 5.3577 6.7012 4.3616 7.4659 4.8188 6.1862 8.3553 7.2687 7.4765 6.3529 5.8200 3.8983 5.3721 3.9802 3.2909 4.2382 4.6221 5.5310 7.1053 4.7202 3.3460 1.5537 1.2651 2.8737 6.2723 5.1860 4.1306 2.9211 3.2049 5.2360 1.7668 1.3219 3.5885 2.4290 5.1155 1.7130 5.7054 1.4285 1.6001 5.7081 1.4046 1.3702 1.3804 1.3283 1.4072 1.3463 4.9580 2.9378 2.2981 2.8620 2.3031 2.1434 1.8923 1.3766 1.0803 1.2031 1.6841 1.7949 2.4841 1.8226 1.8725 1.7802 1.5360 2.0175 2.3356 8.4008 3.0991 3.9509 3.9752 2.3091 2.4361 2.4169 2.7531 3.3136 2.9124 7.5636 6.4066 7.3852 6.1167 6.4622 7.3678 6.4979 1.0872 1.0874 1.0872 1.0887 1.0902 1.0918 1.0942 1.0952 1.0985 1.0997 1.0996 1.0801 1.0797
irintensity: 1.1846 1.2340 2.6038 0.0042 0.7917 8.1439 0.5346 5.2292 2.0150 2.4798 2.0770 10.6183 3.5708 0.6850 0.5699 11.3643 11.8939 27.8390 1.0149 1.8102 6.8162 0.1516 13.2006 18.9603 2.4026 1.5199 10.8651 17.6011 6.8793 159.3659 9.0255 14.9327 10.0348 6.8681 0.4127 10.1571 10.0187 2.8266 78.3866 19.5836 48.9270 26.0431 44.8551 4.6968 1.1690 7.9009 0.9283 0.3624 3.2278 1.0833 0.1310 2.0604 0.8429 2.7094 5.1631 2.7912 10.7437 32.1365 11.1556 4.9443 0.3956 1.7959 0.9036 7.9732 12.4438 8.4030 15.4336 4.9363 17.0042 1.6945 5.8386 82.5234 44.4699 429.2627 93.3451 285.8718 16.2764 5.3495 34.4508 95.4393 30.7447 2.5597 317.7731 6.4462 11.5323 30.3291 19.6128 32.5776 1.0955 1.5190 3.7758 1.9588 7.2068 8.4422 12.6638 24.4713 11.6316 24.8786 12.6445 9.3087 22.5577 125.6884
temp: 298.150 k
press: 1.00000 atm
elementType: 9 8 8 7 7 6 6 6 6 6 6 6 6 6 6 6 6 6 6 6 6 6 6 1 1 1 1 1 1 1 1 1 1 1 1 1
symmnumber: 1
zpe: 704233.2 jmol-1
zpe.correction: 0.268228 hartree
zpe.thermalcorrener: 0.287039 hartree
zpe.thermalcorrenthalpy: 0.287984 hartree
zpe.thermalcorrgfe: 0.218818 hartree
zpe.sumelectzpe: -1051.933837 hartree
zpe.sumelectthermal: -1051.915026 hartree
zpe.sumelectthermalent: -1051.914082 hartree
zpe.sumelectthermalfe: -1051.983247 hartree
dipole: 0.0083 -1.5836 -0.5412
dipole: 1.6735
quadrupole: -87.1853 -130.0064 -140.7093
quadrupole: 13.1665 -7.5702 9.1057
quadrupole: 32.1150 -10.7061 -21.4089 13.1665 -7.5702 9.1057
hfenergy: -1052.2020651 hartree
pointgroup: C01 [X(C18H13F1N2O2)]
dipole: 0.0221742 -0.6293846 0.1921046 debye
polarizability: 342.0526147|1.0604684|255.0027687|-33.5602439|0.7646818|101.9653768 unknown
InChI: InChI=1S/C18H13FN2O2/c19-16-11-4-3-9-15(16)18(23)21-20-17(22)14-10-5-7-12-6-1-2-8-13(12)14/h1-11,20-21H
charge 0 multiplicity 1
36 atoms
F  4.097322 2.439154 -0.617739
O  -0.456863 -2.257525 -1.215426
O  1.77736 1.416674 0.89177
N  -0.046719 -0.350655 -0.007289
N  1.315115 -0.517304 -0.273636
C  -3.074149 0.120135 -0.026997
C  -4.45138 0.087488 0.437808
C  -2.375102 -1.141551 -0.171475
C  -2.510256 1.399745 -0.363427
C  -5.089995 -1.170383 0.69039
C  -3.055133 -2.351548 0.0446
C  -5.167626 1.317614 0.614825
C  -4.412401 -2.371102 0.474191
C  -0.926937 -1.285238 -0.528877
C  -3.239044 2.579425 -0.190275
C  -4.572879 2.544831 0.321275
C  3.644813 0.115065 -0.059272
C  2.205224 0.419721 0.225383
C  4.559637 1.130122 -0.426064
C  4.15918 -1.202228 0.084605
C  5.924529 0.88133 -0.645103
C  5.525743 -1.479808 -0.130422
C  6.409302 -0.436698 -0.493755
H  -1.511139 1.458471 -0.805215
H  -6.12815 -1.172445 1.043235
H  -2.508733 -3.286768 -0.113416
H  -6.201949 1.274068 0.976368
H  -4.910624 -3.330295 0.647853
H  -2.78612 3.539581 -0.459515
H  -5.128012 3.478474 0.46015
H  -0.256054 0.427692 0.627181
H  1.512477 -1.315691 -0.888099
H  3.484959 -2.005917 0.401197
H  6.580315 1.707886 -0.933315
H  5.900422 -2.500329 -0.004917
H  7.471569 -0.644191 -0.657797
