program: Gaussian 09
title: 000259042
version: EM64L-G09RevD.01
frameworkgroup: C1[X(C10H19NO2)]
method: RPBEPBE
basis: SDD
operation: Freq
keyword: #p
keyword: freq=noraman
keyword: PBEPBE/SDD
title: #p freq=noraman PBEPBE/SDD
converged: YES YES NO NO
title: Mulliken charges:
elementType: O O N C C C C C C C C C C H H H H H H H H H H H H H H H H H H H
charge: -0.320478 -0.305990 -0.174675 -0.053619 -0.421960 -0.420686 -0.367500 -0.407103 -0.396324 -0.345185 0.290626 -0.701972 -0.490541 0.259466 0.209425 0.199951 0.217439 0.200977 0.202891 0.208471 0.210275 0.261055 0.197982 0.195911 0.203358 0.213735 0.207781 0.208126 0.218651 0.222940 0.238568 0.238406
chargesum: 0.00000
title: Mulliken charges with hydrogens summed into heavy atoms:
elementType: O O N C C C C C C C C C C
charge: -0.320478 -0.305990 -0.174675 0.205847 -0.012584 -0.002270 0.043862 0.064226 -0.002431 0.071908 0.290626 -0.067415 0.209373
polarizability: 1.35412327e+02 -2.84060013e+00 1.17235374e+02 1.13877311e+00 4.70519310e+00 1.04818565e+02
1716.lowfreq: -22.3075 -10.4487 0.0010 0.0011 0.0012 15.8595 38.6071 46.9254 63.1527
frequency: 37.9988 46.7698 62.9652 86.4297 93.6672 117.1907 146.2198 153.2487 181.7568 215.4288 250.0374 281.9972 301.6058 342.0908 364.2646 375.9628 458.5853 502.9598 521.2393 540.3204 639.1652 689.7011 717.7789 747.2519 811.5525 829.5972 859.1484 869.5642 890.0112 906.0909 929.8567 962.4333 1007.3551 1025.2764 1054.1980 1056.7077 1078.2767 1094.4393 1101.6329 1117.6912 1139.1983 1141.2911 1149.3253 1181.6863 1218.1667 1235.0326 1251.5398 1264.6804 1271.0339 1291.7919 1311.0608 1331.2244 1336.5593 1340.3127 1348.2273 1353.6607 1358.3263 1387.1115 1399.7202 1436.6607 1449.1173 1454.3151 1459.1856 1462.9761 1471.4619 1471.6356 1474.0153 1475.3266 1482.0327 1486.2623 1637.1511 2964.6809 2968.2350 2970.9168 2978.4928 2980.5066 2982.1213 2985.5655 2999.2749 3011.2382 3033.8057 3036.3656 3041.7701 3053.9018 3065.3584 3070.6435 3071.4013 3087.9556 3099.1008 3136.5147
redmass: 3.3516 1.6466 3.3951 1.2407 4.0749 3.1449 2.6939 2.7392 2.6171 1.1807 2.2674 2.7179 3.4747 4.1707 1.9366 3.5322 2.6327 3.9240 2.7205 3.2963 2.1711 11.2163 2.9323 1.3315 1.5055 3.1643 1.6237 1.5117 2.8614 1.8301 2.2038 2.3660 1.9715 2.4152 2.7185 1.9335 2.1612 1.3907 2.1332 1.2532 2.5665 2.0061 1.6099 1.4981 1.6713 1.5721 1.6842 1.2797 1.3798 1.1542 1.3368 1.4183 1.4309 1.4704 1.5136 1.3869 1.4374 1.2151 1.6484 1.3396 1.0508 1.0898 1.0848 1.0872 1.0579 1.0628 1.0749 1.0433 1.0823 1.0857 9.4266 1.0655 1.0525 1.0465 1.0590 1.0611 1.0622 1.0629 1.0294 1.0973 1.0991 1.0995 1.1022 1.1029 1.0954 1.0926 1.0990 1.0940 1.1045 1.1044
irintensity: 0.0856 0.0500 0.2771 0.4800 3.8574 0.2289 7.4707 0.3939 0.8842 0.1844 1.3343 2.3987 9.4855 9.9327 1.7409 2.6776 1.4370 8.2127 3.4806 2.6999 1.8919 17.6972 15.4753 4.5922 1.5974 8.6325 3.7125 12.2053 11.1009 4.4465 10.3908 3.4079 7.9626 46.1426 68.3960 20.1958 3.9511 2.9865 7.5911 0.1551 5.9051 120.5242 1.7530 30.3861 4.3250 89.8672 64.0761 6.4111 31.4062 2.0292 9.3728 15.0211 32.2220 1.3911 13.5996 11.0425 1.8958 10.1608 32.6853 94.0414 11.2425 7.5050 5.2407 13.7349 11.0668 12.5070 9.4916 12.9847 10.9714 13.9693 416.1452 28.0627 8.4036 54.6705 27.7257 11.5282 76.9455 34.0824 49.8163 5.1212 30.4428 22.6895 45.3965 80.8809 23.4335 79.9598 47.1591 5.5255 31.4220 19.6647
temp: 298.150 k
press: 1.00000 atm
elementType: 8 8 7 6 6 6 6 6 6 6 6 6 6 1 1 1 1 1 1 1 1 1 1 1 1 1 1 1 1 1 1 1
symmnumber: 1
zpe: 736160.4 jmol-1
zpe.correction: 0.280389 hartree
zpe.thermalcorrener: 0.295100 hartree
zpe.thermalcorrenthalpy: 0.296045 hartree
zpe.thermalcorrgfe: 0.237898 hartree
zpe.sumelectzpe: -596.617803 hartree
zpe.sumelectthermal: -596.603092 hartree
zpe.sumelectthermalent: -596.602147 hartree
zpe.sumelectthermalfe: -596.660294 hartree
dipole: 1.8967 0.8577 1.7005
dipole: 2.6879
quadrupole: -76.3191 -80.9174 -81.4702
quadrupole: -5.5145 -6.2352 -1.8339
quadrupole: 3.2498 -1.3485 -1.9013 -5.5145 -6.2352 -1.8339
hfenergy: -596.8981919 hartree
pointgroup: C01 [X(C10H19N1O2)]
dipole: -0.5288204 0.698746 -0.5919501 debye
polarizability: 133.5573032|-5.9738601|119.5278253|-3.0158466|-3.2504843|104.3811376 unknown
InChI: InChI=1S/C10H19NO2/c1-3-6-9-7-4-5-8-11(9)10(12)13-2/h9H,3-8H2,1-2H3
charge 0 multiplicity 1
32 atoms
O  1.915296 -0.831248 -0.917467
O  1.469638 -2.152562 0.971868
N  -0.095064 -0.574437 0.196178
C  -0.493675 0.472556 -0.789253
C  -1.873581 0.094103 -1.396886
C  -2.9407 -0.216741 -0.319067
C  -2.42939 -1.31148 0.646311
C  -1.069463 -0.910809 1.259511
C  -0.481757 1.893245 -0.158895
C  0.899055 2.3222 0.384837
C  1.103596 -1.253796 0.162694
C  0.892117 3.759448 0.94773
C  3.207373 -1.53853 -1.012778
H  0.264297 0.452831 -1.589173
H  -1.740228 -0.802053 -2.034997
H  -2.214857 0.91699 -2.054287
H  -3.880435 -0.541562 -0.804311
H  -3.181781 0.700193 0.255292
H  -3.158038 -1.486269 1.460962
H  -2.309702 -2.266116 0.097505
H  -1.203922 -0.034034 1.926186
H  -0.636504 -1.728489 1.857424
H  -1.234226 1.968449 0.651775
H  -0.80274 2.607293 -0.945117
H  1.651535 2.237783 -0.4242
H  1.217538 1.614491 1.175206
H  0.610666 4.492485 0.167837
H  0.166559 3.859146 1.777512
H  1.887303 4.044695 1.33532
H  3.703183 -1.094359 -1.888573
H  3.048742 -2.621089 -1.154969
H  3.804863 -1.382933 -0.098577
