program: Gaussian 09
title: 000259049
version: EM64L-G09RevD.01
frameworkgroup: C1[X(C15H29NO2)]
method: RPBEPBE
basis: SDD
operation: Freq
keyword: #p
keyword: freq=noraman
keyword: PBEPBE/SDD
title: #p freq=noraman PBEPBE/SDD
converged: YES YES NO NO
title: Mulliken charges:
elementType: O O N C C C C C C C C C C C C C C C H H H H H H H H H H H H H H H H H H H H H H H H H H H H H
charge: -0.313214 -0.308582 -0.185515 -0.055619 -0.426573 -0.421528 -0.422247 -0.369164 -0.407544 -0.334345 0.287030 -0.358532 -0.698758 -0.295275 -0.364976 -0.344109 -0.354087 -0.693658 0.260067 0.209856 0.200036 0.217060 0.201958 0.196790 0.200983 0.208806 0.202203 0.261079 0.209574 0.191410 0.203633 0.193531 0.192739 0.212946 0.210229 0.214774 0.229430 0.213362 0.195447 0.231031 0.194939 0.182297 0.201121 0.194791 0.216287 0.211547 0.208770
chargesum: 0.00000
title: Mulliken charges with hydrogens summed into heavy atoms:
elementType: O O N C C C C C C C C C C C C C C C
charge: -0.313214 -0.308582 -0.185515 0.204448 -0.016681 -0.002510 -0.024474 0.041845 0.063110 0.060699 0.287030 0.027738 -0.060809 0.147517 0.061502 0.033127 0.041825 -0.057055
polarizability: 2.13094989e+02 -1.99303553e+00 1.64696848e+02 -1.61118817e-01 -3.20156821e+00 1.47802805e+02
1716.lowfreq: -2.9875 -0.0009 -0.0008 -0.0003 7.6370 13.9386 18.4961 31.5253 48.0722
frequency: 18.0118 31.1826 47.9632 54.3076 60.8719 62.6604 83.8447 95.3531 105.1110 120.2096 130.9103 135.4223 158.2856 167.0839 216.5162 232.6013 233.4658 261.1784 270.4316 305.4408 321.8912 334.7256 360.6579 380.0782 413.4945 447.8575 473.3464 514.5928 536.4976 559.7690 641.8252 688.0976 712.9504 729.9498 733.4817 769.1914 795.1389 814.2006 830.5012 850.8302 876.1057 882.2852 888.0847 899.6051 916.6735 936.5424 965.1730 971.1717 992.0269 1010.2197 1022.9020 1040.7703 1053.0302 1060.9796 1073.9452 1076.5240 1085.0720 1094.8409 1101.3468 1119.6534 1137.9236 1144.1990 1165.0956 1178.8715 1206.1550 1213.2470 1226.5726 1242.6713 1249.6815 1255.6729 1264.4871 1274.3974 1279.7504 1287.8338 1289.8842 1298.6089 1300.3567 1317.3819 1325.1841 1330.7629 1339.5836 1342.4440 1350.3545 1353.0637 1354.5869 1357.2026 1376.7554 1390.6951 1392.3452 1406.4467 1451.5325 1456.4827 1460.3825 1464.6991 1466.1928 1467.7283 1470.4739 1471.4232 1476.8559 1477.8344 1478.0104 1480.4743 1483.4191 1488.2465 1489.3472 1630.0696 2955.5430 2960.0544 2961.3426 2964.9652 2970.3049 2971.8351 2972.3648 2972.4184 2975.1521 2980.6090 2984.8800 2986.9090 2997.7585 2998.3336 3012.3167 3017.2251 3025.5164 3033.4223 3038.8369 3041.5753 3050.5890 3052.3089 3068.4370 3069.2958 3070.8699 3071.4415 3071.5038 3086.9061 3093.6843
redmass: 3.9329 3.6888 3.2360 4.0847 1.5832 1.7327 3.4283 2.8493 4.1391 2.5427 2.4717 2.4393 2.3817 3.4789 2.1643 1.1128 1.1974 3.2195 2.7035 3.1889 3.0837 2.8048 2.4776 3.6540 3.1047 2.8752 3.0043 2.4834 3.8967 3.5503 2.2453 10.6876 2.4929 1.2182 1.0693 1.1838 1.2941 1.5014 3.0641 1.2624 2.3654 1.9687 1.7206 1.9604 1.5726 2.3481 1.8643 1.1983 2.3924 3.0674 3.0758 2.7926 1.9641 2.7080 2.0995 2.4734 2.0330 1.3212 2.2214 2.4545 2.6463 2.3499 1.7606 1.5106 1.5640 1.4071 1.7267 1.4949 1.2786 1.5882 1.2875 1.2020 1.2657 1.0521 1.0948 1.1336 1.2553 1.3448 1.4173 1.3718 1.6510 1.4155 1.3877 1.5366 1.5840 1.4289 1.3341 1.2179 1.2154 1.9978 1.1117 1.0900 1.0851 1.0860 1.0710 1.0695 1.0734 1.0854 1.0738 1.0428 1.0425 1.0714 1.0787 1.0869 1.0897 9.3003 1.0589 1.0588 1.0663 1.0630 1.0565 1.0588 1.0406 1.0365 1.0607 1.0629 1.0616 1.0622 1.0975 1.0960 1.1005 1.0571 1.1022 1.0974 1.1025 1.1026 1.1029 1.1029 1.0996 1.1007 1.0987 1.0990 1.0885 1.0936 1.1088
irintensity: 0.2773 0.4497 0.0956 1.0391 0.0131 0.0211 0.9536 0.2184 1.2468 0.3319 0.5901 0.1720 0.1791 1.1559 0.7697 0.0085 0.2063 1.3959 2.6604 2.7432 4.0504 10.1850 9.1546 1.7234 1.4463 4.4350 2.8937 5.4213 4.7588 0.2913 2.0430 18.5555 16.6059 5.4686 11.0961 0.0781 3.0116 2.9730 8.1180 1.7491 22.1033 1.5080 4.7562 5.0099 14.5457 18.4068 0.9339 0.7810 18.5711 39.4429 93.6098 1.0122 33.8647 64.2810 3.3394 9.0557 1.4896 4.7198 10.2926 15.0014 9.8732 92.8871 12.3087 31.9230 0.4694 17.0207 99.8647 37.1010 11.9429 80.6600 4.8591 2.0718 5.4069 1.5207 2.4463 2.5543 3.3362 3.8061 29.3754 8.6054 55.3384 5.2264 4.7151 2.9444 2.4560 0.2677 1.0478 13.9142 11.8115 73.5909 42.4868 7.5216 3.4794 13.3650 2.8698 1.4361 0.8795 19.9743 6.0039 10.6370 12.1796 6.0579 9.7711 35.0616 7.0911 400.9762 14.7027 10.1388 22.3081 6.0139 61.2309 59.9397 17.3872 36.5262 83.9308 44.8160 35.7880 25.7459 5.4985 5.3152 1.7198 60.7579 17.3133 49.8181 18.7377 71.8149 17.1163 80.2700 41.9726 92.5175 55.5862 48.3461 53.1263 5.7775 35.9805
temp: 298.150 k
press: 1.00000 atm
elementType: 8 8 7 6 6 6 6 6 6 6 6 6 6 6 6 6 6 6 1 1 1 1 1 1 1 1 1 1 1 1 1 1 1 1 1 1 1 1 1 1 1 1 1 1 1 1 1
symmnumber: 1
zpe: 1104085.4 jmol-1
zpe.correction: 0.420524 hartree
zpe.thermalcorrener: 0.441850 hartree
zpe.thermalcorrenthalpy: 0.442794 hartree
zpe.thermalcorrgfe: 0.368109 hartree
zpe.sumelectzpe: -792.739065 hartree
zpe.sumelectthermal: -792.717739 hartree
zpe.sumelectthermalent: -792.716794 hartree
zpe.sumelectthermalfe: -792.791480 hartree
dipole: 1.4073 1.5072 -1.4785
dipole: 2.5373
quadrupole: -101.7461 -116.7089 -113.4504
quadrupole: -0.8574 2.8003 3.5313
quadrupole: 8.8890 -6.0738 -2.8152 -0.8574 2.8003 3.5313
hfenergy: -793.1595888 hartree
pointgroup: C01 [X(C15H29N1O2)]
dipole: -0.5353952 0.5687067 0.6216403 debye
polarizability: 213.1221098|1.394722|164.2623436|-1.1022776|4.0595476|148.2101887 unknown
InChI: InChI=1S/C15H29NO2/c1-3-5-9-13-18-15(17)16-12-8-7-11-14(16)10-6-4-2/h14H,3-13H2,1-2H3
charge 0 multiplicity 1
47 atoms
O  0.518782 -1.030599 0.93236
O  0.27629 -1.929487 -1.228766
N  -1.49314 -0.7905 -0.179141
C  -2.039266 -0.052956 0.99728
C  -3.368878 -0.723377 1.44258
C  -4.371115 -0.902431 0.276422
C  -2.200726 1.464577 0.702945
C  -3.710237 -1.684728 -0.882133
C  -2.400638 -0.999188 -1.330984
C  -0.873243 2.180473 0.372043
C  -0.210805 -1.2945 -0.249712
C  -1.055038 3.693481 0.115628
C  0.272753 4.40931 -0.21377
C  1.932596 -1.492597 0.915951
C  2.853287 -0.456249 0.257539
C  4.339449 -0.876301 0.336577
C  5.287359 0.154051 -0.319442
C  6.772292 -0.260476 -0.239479
H  -1.298485 -0.162801 1.805745
H  -3.133793 -1.719809 1.866752
H  -3.821126 -0.120471 2.253618
H  -5.273214 -1.43395 0.633722
H  -4.71062 0.086979 -0.091042
H  -2.653598 1.930023 1.60257
H  -2.921012 1.625625 -0.124105
H  -3.482091 -2.717312 -0.55267
H  -4.395797 -1.756932 -1.748211
H  -1.857274 -1.607092 -2.071748
H  -2.633824 -0.020145 -1.798823
H  -0.156567 2.028854 1.20509
H  -0.412114 1.710013 -0.519942
H  -1.771402 3.839478 -0.719081
H  -1.518458 4.1637 1.007412
H  0.741159 3.977123 -1.118175
H  0.994975 4.306105 0.618164
H  0.118487 5.488952 -0.395478
H  1.986245 -2.459577 0.383867
H  2.174212 -1.631642 1.983832
H  2.713051 0.523413 0.756005
H  2.554847 -0.336667 -0.801129
H  4.474127 -1.860175 -0.159077
H  4.633651 -1.016585 1.39821
H  4.9952 0.290192 -1.380281
H  5.149062 1.139454 0.170556
H  7.428307 0.489841 -0.717972
H  6.941151 -1.229306 -0.746492
H  7.097379 -0.37189 0.812386
