program: Gaussian 09
title: 000259102
version: EM64L-G09RevD.01
frameworkgroup: C1[X(C26H24O2P2)]
method: RPBEPBE
basis: SDD
operation: Freq
keyword: #p
keyword: freq=noraman
keyword: PBEPBE/SDD
title: #p freq=noraman PBEPBE/SDD
converged: YES YES NO NO
title: Mulliken charges:
elementType: P P O O C C C C C C C C C C C C C C C C C C C C C C C C C C H H H H H H H H H H H H H H H H H H H H H H H H
charge: 0.975753 0.975835 -0.665184 -0.664926 -0.648714 -0.648493 -0.108530 -0.092766 -0.109143 -0.092199 -0.244360 -0.242400 -0.243259 -0.302257 -0.303382 -0.302529 -0.303738 -0.242957 -0.240219 -0.238934 -0.240235 -0.209667 -0.211830 -0.209736 -0.211903 -0.239221 -0.228306 -0.224651 -0.228330 -0.224574 0.244213 0.310050 0.310088 0.244343 0.218647 0.217856 0.218655 0.294848 0.299024 0.295289 0.299139 0.218059 0.233005 0.232292 0.232982 0.234753 0.235103 0.234738 0.235078 0.232336 0.232679 0.232501 0.232647 0.232531
chargesum: 0.00000
title: Mulliken charges with hydrogens summed into heavy atoms:
elementType: P P O O C C C C C C C C C C C C C C C C C C C C C C C C C C
charge: 0.975753 0.975835 -0.665184 -0.664926 -0.094450 -0.094062 -0.108530 -0.092766 -0.109143 -0.092199 -0.025714 -0.024543 -0.024604 -0.007409 -0.004359 -0.007239 -0.004599 -0.024899 -0.007213 -0.006643 -0.007254 0.025087 0.023273 0.025002 0.023175 -0.006885 0.004373 0.007849 0.004317 0.007957
polarizability: 3.12347742e+02 -1.53262808e-01 3.24585602e+02 3.22417536e+01 -3.74932484e-02 3.25481937e+02
1716.lowfreq: -0.0004 0.0007 0.0008 5.4009 6.7422 14.5192 15.3021 19.1609 22.3874
frequency: 14.9411 19.0359 22.1434 24.8687 25.7878 36.6597 42.1439 45.4248 52.2387 68.8916 76.2502 119.1351 141.1024 147.4297 155.8708 169.1798 172.3284 202.1693 225.6118 226.4651 231.0545 249.3910 267.4676 275.4636 283.4313 356.4809 374.9954 387.7316 395.1928 395.6977 400.7908 401.1180 416.5739 446.9872 449.0774 494.0953 504.2034 509.2927 539.3118 611.4858 611.5511 612.3278 612.5642 651.8613 670.4524 688.5722 688.6767 697.3813 702.3596 702.4951 708.9423 710.9531 724.5215 748.7130 757.8337 766.0513 767.3225 770.6149 856.6847 858.1498 863.5798 864.6602 903.5301 931.0064 931.1653 937.0135 938.0777 964.0019 973.5608 985.5329 985.6787 986.5441 986.5960 988.2094 988.6346 990.1611 991.4433 1008.3639 1008.4620 1010.0410 1010.3742 1020.0325 1020.6380 1020.9410 1021.0192 1042.3768 1075.1231 1075.2582 1080.1351 1084.0545 1086.7901 1087.1993 1090.9318 1091.5139 1110.2380 1173.7333 1173.7453 1174.2446 1174.3064 1187.3422 1187.5070 1190.1803 1192.1296 1209.3495 1282.1011 1287.6816 1309.2333 1309.4138 1314.5204 1315.2158 1377.7777 1377.8219 1380.7630 1380.8749 1424.4874 1424.5889 1427.5758 1427.7146 1432.9799 1438.0018 1465.2689 1465.2833 1467.6852 1467.6930 1586.3185 1586.3563 1589.7915 1589.9040 1595.5474 1595.5724 1597.5167 1597.6539 3012.8349 3019.7698 3079.5215 3095.1388 3119.6748 3119.8279 3123.5431 3123.6128 3128.3119 3128.3598 3130.2656 3130.3345 3137.5200 3137.6135 3139.4128 3139.4874 3149.5827 3149.6811 3151.0613 3151.1030 3164.7610 3164.8648 3165.9782 3166.0872
redmass: 5.9232 5.3640 3.9523 3.8142 5.3576 5.1074 5.8246 4.1164 4.3696 4.6863 5.4261 7.5990 3.0633 4.7711 4.7537 5.7201 5.3102 5.5958 4.6200 5.0805 3.0972 4.4625 6.3594 6.7770 5.4423 6.7160 6.0219 5.4589 2.7840 2.8425 2.8783 2.9005 6.0031 4.7630 4.7104 4.1985 4.1290 4.5226 5.1490 6.4539 6.4533 6.4359 6.4297 6.7378 5.7703 6.2706 6.3613 6.1208 1.9307 1.8560 1.9963 1.8552 2.9215 1.3128 1.6999 1.7148 1.7995 1.8636 1.2574 1.2554 1.2449 1.2438 1.8796 1.3862 1.3964 1.3809 1.3815 10.4440 5.3264 1.5962 1.8141 2.8363 3.6652 1.3997 1.4034 6.0386 6.0168 1.3299 1.3292 1.3245 1.3233 3.0203 2.9595 2.9804 2.9767 4.4828 1.6440 1.6442 1.5148 1.6877 2.5517 2.6076 2.5965 2.7136 1.1784 1.0563 1.0563 1.0562 1.0561 1.1241 1.1242 1.1279 1.1246 1.2053 1.1481 1.3122 1.3267 1.3271 1.3144 1.3134 8.3532 8.3900 8.6121 8.6415 2.0840 2.1052 2.1251 2.1192 1.0877 1.0925 2.0507 2.0479 2.0481 2.0470 6.0729 6.0753 6.0875 6.0975 5.8454 5.8465 5.8446 5.8363 1.0586 1.0572 1.1020 1.1046 1.0866 1.0866 1.0855 1.0855 1.0871 1.0871 1.0874 1.0874 1.0917 1.0917 1.0919 1.0919 1.0961 1.0961 1.0962 1.0963 1.1015 1.1015 1.1015 1.1015
irintensity: 0.2107 0.2155 0.1601 0.0239 0.7114 0.1373 2.0693 0.4218 0.0462 0.7290 0.0282 0.8186 9.3018 0.5344 8.0804 6.0342 15.0553 5.0550 6.6891 0.6686 6.0631 2.1543 2.8259 2.5845 5.6766 56.6464 0.3640 1.1839 0.7750 0.2010 0.0592 0.0221 14.8566 15.7418 7.8532 64.6724 56.3293 145.7497 0.0317 0.0129 0.0180 1.1213 0.0924 32.9906 0.1729 2.4870 13.5434 47.6484 21.0038 25.5091 3.9280 281.9734 49.0296 63.5165 14.3956 8.0880 36.5124 0.5593 0.3932 0.3131 0.2982 0.0871 34.8316 0.1062 0.5049 2.2024 0.0186 39.5957 25.0173 0.8149 1.0698 0.9080 1.9616 0.2517 0.8328 2.4422 10.5148 0.1992 0.1155 0.7330 0.5913 2.8720 3.0470 3.5476 1.4130 0.1875 7.8870 10.3417 5.6082 5.4894 36.6376 40.6207 2.9201 36.4624 27.2322 0.2894 0.1582 0.2268 0.0843 7.1415 5.3738 11.8219 0.0435 48.4196 5.3053 4.2680 1.0291 1.0101 13.2859 6.2958 1.4619 1.3880 1.1180 0.0952 0.1860 4.3012 37.7512 27.2668 0.1403 21.6401 13.4355 13.0130 6.9718 2.4794 0.1755 0.1732 0.4450 0.0949 0.5241 1.1590 0.8741 0.9266 4.2085 17.9497 2.4460 2.1901 8.5109 8.2074 5.1705 0.8024 3.0963 3.6335 4.4254 3.8439 5.5320 2.9889 6.2887 5.8565 31.4003 0.4446 30.1602 29.8050 16.9381 57.0537 63.8565 0.8549
temp: 298.150 k
press: 1.00000 atm
elementType: 15 15 8 8 6 6 6 6 6 6 6 6 6 6 6 6 6 6 6 6 6 6 6 6 6 6 6 6 6 6 1 1 1 1 1 1 1 1 1 1 1 1 1 1 1 1 1 1 1 1 1 1 1 1
symmnumber: 1
zpe: 1110401.7 jmol-1
zpe.correction: 0.422930 hartree
zpe.thermalcorrener: 0.450959 hartree
zpe.thermalcorrenthalpy: 0.451903 hartree
zpe.thermalcorrgfe: 0.359174 hartree
zpe.sumelectzpe: -1835.939145 hartree
zpe.sumelectthermal: -1835.911116 hartree
zpe.sumelectthermalent: -1835.910172 hartree
zpe.sumelectthermalfe: -1836.002900 hartree
dipole: -0.0056 6.2707 0.0127
dipole: 6.2707
quadrupole: -171.0554 -183.4877 -180.5105
quadrupole: -0.0457 17.6041 -0.0091
quadrupole: 7.2958 -5.1365 -2.1593 -0.0457 17.6041 -0.0091
hfenergy: -1836.3620743 hartree
pointgroup: C01 [X(C26H24O2P2)]
dipole: 0.0187347 -0.0140261 -2.4669671 debye
polarizability: 314.2449525|32.568768|323.58866|-0.3425527|0.1908586|324.581669 unknown
InChI: InChI=1S/C26H24O2P2/c27-29(23-13-5-1-6-14-23,24-15-7-2-8-16-24)21-22-30(28,25-17-9-3-10-18-25)26-19-11-4-12-20-26/h1-20H,21-22H2
charge 0 multiplicity 1
54 atoms
P  -2.149764 0.744477 0.818557
P  2.136375 -0.74181 0.859091
O  -2.018466 1.937722 1.907758
O  1.989374 -1.921161 1.961234
C  -0.653268 -0.412389 0.76954
C  0.640922 0.414228 0.772208
C  -2.288977 1.449455 -0.917417
C  -3.643042 -0.336254 1.151547
C  2.299321 -1.469568 -0.86557
C  3.625225 0.343344 1.196727
C  -2.268945 0.655888 -2.088367
C  -3.904736 -1.539288 0.455337
C  2.307097 -0.689856 -2.045921
C  4.497165 -0.099279 2.218412
C  -2.407763 2.856198 -1.007199
C  -4.517442 0.110769 2.169214
C  2.406211 -2.878307 -0.936505
C  3.885956 1.546128 0.499599
C  -2.372358 1.27467 -3.35528
C  -5.054213 -2.295882 0.777541
C  2.426085 -1.324759 -3.303419
C  5.642437 0.663773 2.538174
C  -2.512586 3.470471 -2.275593
C  -5.665805 -0.648716 2.486425
C  2.526502 -3.508763 -2.195582
C  5.032355 2.3063 0.824334
C  -2.496275 2.680968 -3.449331
C  -5.935835 -1.849868 1.790101
C  2.537678 -2.733268 -3.378654
C  5.911836 1.864283 1.840472
H  -0.730493 -1.054448 -0.126708
H  -0.700694 -1.060396 1.663024
H  0.675548 1.07617 1.656022
H  0.730601 1.041768 -0.133133
H  -2.172206 -0.435107 -2.031842
H  -3.223917 -1.901589 -0.324292
H  2.220795 0.402667 -2.003635
H  4.255862 -1.0266 2.751347
H  -2.409444 3.441486 -0.079746
H  -4.275767 1.039076 2.700294
H  2.387422 -3.452262 -0.002155
H  3.2061 1.906096 -0.281963
H  -2.358132 0.662297 -4.263612
H  -5.259212 -3.230343 0.243827
H  2.433693 -0.72329 -4.219086
H  6.319466 0.325288 3.330052
H  -2.606645 4.559594 -2.348254
H  -6.344823 -0.306846 3.275146
H  2.611392 -4.599513 -2.253693
H  5.236408 3.240602 0.289977
H  -2.579603 3.158112 -4.432397
H  -6.825963 -2.439031 2.037845
H  2.633081 -3.222963 -4.354427
H  6.799567 2.456225 2.090176
