program: Gaussian 09
title: 000259021
version: EM64L-G09RevD.01
frameworkgroup: C1[X(C16H10ClFO3)]
method: RPBEPBE
basis: SDD
operation: Freq
keyword: #p
keyword: freq=noraman
keyword: PBEPBE/SDD
title: #p freq=noraman PBEPBE/SDD
converged: YES YES NO NO
title: Mulliken charges:
elementType: Cl F O O O C C C C C C C C C C C C C C C C H H H H H H H H H H
charge: -0.007726 -0.195449 -0.263204 -0.250559 -0.209135 0.197456 0.169947 0.547410 -0.492384 -0.339052 -0.397298 -0.203151 -0.278983 0.443560 -0.311349 0.077182 -0.290323 -0.329598 -0.391070 -0.400402 0.353476 0.254199 0.258866 0.246798 0.244764 0.244953 0.274108 0.235485 0.260300 0.287214 0.263963
chargesum: 0.00000
title: Mulliken charges with hydrogens summed into heavy atoms:
elementType: Cl F O O O C C C C C C C C C C C C C C C C
charge: -0.007726 -0.195449 -0.263204 -0.250559 -0.209135 0.197456 0.169947 0.547410 -0.238185 -0.080186 -0.150500 0.286566 -0.004875 0.443560 -0.075864 0.077182 -0.290323 -0.069298 -0.103856 -0.136438 0.353476
polarizability: 3.93459036e+02 1.22482752e+00 2.02742821e+02 -2.54670253e+00 1.58901841e+00 9.99950030e+01
1716.lowfreq: -20.5035 -2.9578 -0.0010 -0.0009 -0.0005 2.0380 6.5590 23.7561 24.0470
frequency: -20.2719 23.6790 23.9935 34.0131 68.5897 84.6700 120.1094 157.2722 169.7840 182.8998 208.6011 225.1426 229.6043 261.7671 286.2039 345.9660 359.7375 383.5458 419.5707 425.3976 438.4692 449.4824 506.5897 522.0295 558.7357 590.3469 598.7744 602.9672 669.5819 677.8382 680.5839 722.3418 738.5367 752.0771 781.0264 813.5284 822.8926 825.8474 840.6224 863.3776 872.5334 874.0529 887.8567 935.6698 941.9978 951.3391 978.0538 1009.5317 1010.4501 1052.6223 1063.2365 1064.4612 1120.3395 1132.3223 1134.8929 1177.1885 1196.6597 1210.0745 1242.4277 1257.3482 1268.6013 1311.4389 1322.8751 1357.4321 1365.2129 1389.2484 1392.5531 1458.3116 1468.8722 1478.9947 1485.8861 1530.9312 1579.6569 1597.7838 1599.4544 1622.2476 1632.4740 3021.8290 3096.1500 3103.1113 3133.0639 3148.1946 3148.8555 3178.7486 3183.2803 3186.9046 3187.1994
redmass: 2.2596 6.2428 10.0997 8.3614 8.9972 6.8112 6.3904 8.8800 5.6531 7.7584 4.4514 8.9400 5.3378 9.6216 9.2483 8.3943 4.2407 7.7741 7.7517 2.8397 3.8052 4.3511 7.1422 5.9003 6.9018 4.2558 3.8162 6.6937 7.8922 4.5394 9.7055 3.8939 7.7874 3.5821 6.6383 1.3712 1.6610 4.1839 10.4868 1.5040 1.7764 3.9816 1.8954 3.6258 1.3432 1.3695 4.5866 4.3084 1.2181 2.5057 1.4594 3.5457 1.0370 1.4646 1.3568 2.5581 1.6786 2.9517 2.0752 1.4237 1.6687 1.4670 2.8048 4.7876 1.2973 5.1116 3.7223 3.9855 2.9530 2.1426 1.4614 10.6127 8.3671 7.0256 7.5186 7.9999 5.7682 1.0535 1.0894 1.1191 1.0905 1.0902 1.0894 1.0926 1.0960 1.0960 1.0939
irintensity: 14.0150 0.6516 0.2061 0.0422 2.7512 1.5923 1.7996 0.0709 1.2326 0.7032 0.2733 1.4831 0.2867 4.3805 3.6887 5.3298 0.2943 9.9711 4.8964 4.5022 5.5754 11.5537 30.1593 21.7301 10.6651 9.1313 13.2003 2.2747 4.9960 9.5217 0.8355 1.5332 7.6494 5.8444 2.1893 75.2147 21.6483 17.2174 33.6139 45.0413 44.8467 37.6739 0.0883 5.1879 2.9041 3.5726 167.7447 111.7938 34.6873 98.3990 4.4784 4.1776 0.0113 19.0243 20.2109 36.6392 16.5400 262.6620 445.2509 2.9864 85.2081 32.8768 61.3023 18.5995 0.1207 7.6606 131.5232 226.0187 46.0232 92.8029 97.2767 285.2031 173.3194 240.5808 17.3721 38.8498 243.1628 132.5943 0.5365 26.4012 8.0766 4.0923 9.1116 2.5037 1.4616 5.3775 1.4574
temp: 298.150 k
press: 1.00000 atm
elementType: 17 9 8 8 8 6 6 6 6 6 6 6 6 6 6 6 6 6 6 6 6 1 1 1 1 1 1 1 1 1 1
symmnumber: 1
zpe: 567200.8 jmol-1
zpe.correction: 0.216035 hartree
zpe.thermalcorrener: 0.233212 hartree
zpe.thermalcorrenthalpy: 0.234156 hartree
zpe.thermalcorrgfe: 0.168236 hartree
zpe.sumelectzpe: -1399.769927 hartree
zpe.sumelectthermal: -1399.752750 hartree
zpe.sumelectthermalent: -1399.751806 hartree
zpe.sumelectthermalfe: -1399.817726 hartree
dipole: 5.4212 3.2264 0.2031
dipole: 6.3119
quadrupole: -115.4528 -127.6570 -127.6878
quadrupole: 1.0478 0.5241 -1.5625
quadrupole: 8.1464 -4.0578 -4.0886 1.0478 0.5241 -1.5625
hfenergy: -1399.9859622 hartree
pointgroup: C01 [X(C16H10Cl1F1O3)]
dipole: 2.0615976 -1.3728543 0.1785942 debye
polarizability: 392.5747766|-10.2221147|201.1887538|9.5606913|-15.1398956|102.4333293 unknown
InChI: InChI=1S/C16H10ClFO3/c17-13-8-11(18)3-4-12(13)14(19)5-1-10-2-6-15-16(7-10)21-9-20-15/h1-8H,9H2
charge 0 multiplicity 1
31 atoms
Cl -4.177535 2.15852 -1.662125
F  -6.334071 -2.134517 0.200393
O  4.388116 -2.208182 -0.377222
O  6.132285 -0.583846 -0.0803
O  -1.805266 2.48529 0.296036
C  3.835082 -0.924259 -0.153984
C  4.86846 0.029554 0.021025
C  2.169222 0.797496 0.142325
C  2.490563 -0.581679 -0.101116
C  4.590814 1.378302 0.258873
C  3.223346 1.744061 0.315801
C  5.862627 -2.02514 -0.35487
C  0.792434 1.280218 0.219968
C  -2.909676 0.337718 0.094581
C  -0.36671 0.553743 0.094039
C  -1.686995 1.226334 0.164749
C  -4.089983 0.67585 -0.618857
C  -2.922116 -0.876514 0.83709
C  -5.236551 -0.14255 -0.599623
C  -4.054986 -1.712087 0.894295
C  -5.190971 -1.318411 0.167393
H  1.71391 -1.336635 -0.243952
H  5.390226 2.110532 0.39255
H  2.961973 2.791896 0.499251
H  6.275198 -2.281489 -1.345372
H  6.290296 -2.628748 0.462896
H  0.65917 2.358144 0.397403
H  -0.352697 -0.524397 -0.102343
H  -2.030329 -1.151747 1.409541
H  -6.135011 0.119309 -1.163416
H  -4.065026 -2.634066 1.481169
