program: Gaussian 09
title: 000259013
version: EM64L-G09RevD.01
frameworkgroup: C1[X(C15H10ClN3S)]
method: RPBEPBE
basis: SDD
operation: Freq
keyword: #p
keyword: freq=noraman
keyword: PBEPBE/SDD
title: #p freq=noraman PBEPBE/SDD
converged: YES YES NO NO
title: Mulliken charges:
elementType: Cl S N N N C C C C C C C C C C C C C C C H H H H H H H H H H
charge: -0.036766 0.266953 -0.074616 -0.016264 -0.068587 0.474605 -0.309201 0.446850 -0.350275 -0.361675 -0.220224 -0.228492 -0.350788 -0.352557 -0.230825 -0.327969 -0.270427 -0.214770 -0.201347 -0.103539 0.281879 0.234304 0.242722 0.284758 0.233840 0.232237 0.234420 0.262982 0.261697 0.261075
chargesum: 0.00000
title: Mulliken charges with hydrogens summed into heavy atoms:
elementType: Cl S N N N C C C C C C C C C C C C C C C
charge: -0.036766 0.266953 -0.074616 -0.016264 -0.068587 0.474605 -0.309201 0.446850 -0.068396 -0.127371 0.013617 0.003744 -0.108066 -0.067799 0.003595 -0.064987 -0.270427 0.046927 0.059729 -0.103539
polarizability: 6.01494840e+02 5.69916929e+00 1.91667384e+02 6.47538935e-01 6.85314019e-01 7.77168876e+01
1716.lowfreq: -12.7367 -2.2887 -0.0023 0.0014 0.0015 2.2177 12.8526 23.4603 33.9395
frequency: 10.3577 23.4502 33.9354 44.4399 62.3522 106.2436 127.5337 147.8835 168.9856 206.0815 225.9087 290.0216 311.6031 315.3549 371.7428 382.8150 395.2636 398.7007 412.5356 476.2428 486.5358 506.1940 591.1360 601.0546 608.2566 612.3466 619.1927 629.0487 654.1617 693.8358 713.8296 720.5600 771.1168 777.8417 826.6582 844.3303 850.9350 853.4784 934.2220 937.9674 955.8672 986.7499 987.7664 988.2097 997.8665 998.6573 1005.8975 1026.7683 1041.7549 1068.5446 1086.5251 1095.5593 1112.1626 1175.0684 1176.7450 1191.9401 1219.9849 1237.7469 1288.1329 1304.2761 1321.8619 1365.6771 1380.9926 1394.9332 1403.2999 1416.9896 1441.4222 1479.2355 1493.6943 1552.9730 1580.5124 1582.0057 1600.4917 1610.6454 3017.1912 3126.1567 3134.7456 3135.2300 3148.7523 3159.0905 3163.4690 3174.0039 3174.4328 3178.4469
redmass: 4.3605 8.8585 7.6228 6.6055 7.8978 6.9327 6.9404 8.3626 4.2523 7.9064 5.8520 6.0908 7.6051 4.8431 7.0660 7.2685 10.2460 2.8617 2.9045 4.1887 6.1569 3.4195 11.2474 6.8789 8.2772 6.8276 7.4207 8.1986 8.2097 1.8115 8.4341 3.6925 9.7686 1.7956 1.3264 1.3802 4.6532 1.2562 8.0867 1.4267 1.3620 1.3792 6.2112 1.3916 3.2488 1.7576 1.3349 2.1809 7.4988 2.9455 2.1667 2.4743 1.6225 1.0557 1.1255 1.1248 4.4510 2.8731 1.5100 1.8574 1.3607 4.9362 6.1403 3.9769 4.4692 2.6764 2.4133 2.8137 2.9185 7.5593 6.2269 6.0330 6.4345 5.9984 1.0887 1.0870 1.0902 1.0878 1.0927 1.0886 1.0967 1.0998 1.0956 1.0976
irintensity: 2.2081 0.3851 0.1891 2.1097 0.9005 1.2007 0.2425 0.2569 4.7815 5.3251 4.9497 0.6758 5.9981 6.7280 1.9046 2.1736 28.7179 0.3773 0.2096 8.9223 6.1079 33.6392 2.8868 3.4915 4.5115 8.1973 4.7164 17.8107 32.2754 49.6602 34.4268 4.2185 2.3976 61.4259 25.7003 34.8759 16.1784 0.1352 4.1934 4.9654 4.0177 0.3097 1.4074 3.4421 62.6942 18.3699 0.8697 8.5235 49.3231 116.9631 11.8079 15.6325 14.7122 0.0284 27.9972 13.4188 42.9664 31.1340 17.5113 2.8845 11.6324 5.4198 5.5900 50.2881 16.2289 166.9678 22.0081 152.5453 3.3989 351.1583 101.0800 30.9903 34.9349 8.3496 17.5947 7.2437 5.3922 1.2652 20.9676 0.2493 22.3075 27.9213 3.9821 5.3370
temp: 298.150 k
press: 1.00000 atm
elementType: 17 16 7 7 7 6 6 6 6 6 6 6 6 6 6 6 6 6 6 6 1 1 1 1 1 1 1 1 1 1
symmnumber: 1
zpe: 554628.4 jmol-1
zpe.correction: 0.211247 hartree
zpe.thermalcorrener: 0.228223 hartree
zpe.thermalcorrenthalpy: 0.229167 hartree
zpe.thermalcorrgfe: 0.162361 hartree
zpe.sumelectzpe: -1598.565856 hartree
zpe.sumelectthermal: -1598.548880 hartree
zpe.sumelectthermalent: -1598.547936 hartree
zpe.sumelectthermalfe: -1598.614742 hartree
dipole: -1.0284 -0.9043 0.6482
dipole: 1.5151
quadrupole: -108.5377 -121.6195 -135.0575
quadrupole: 10.4538 0.1867 1.8966
quadrupole: 13.2005 0.1187 -13.3193 10.4538 0.1867 1.8966
hfenergy: -1598.777103 hartree
pointgroup: C01 [X(C15H10Cl1N3S1)]
dipole: -0.4068326 -0.3185908 0.2971718 debye
polarizability: 601.532695|4.0216763|189.9440241|1.3676145|-13.7466039|79.4023925 unknown
InChI: InChI=1S/C15H10ClN3S/c16-13-8-6-11(7-9-13)10-17-15-19-18-14(20-15)12-4-2-1-3-5-12/h1-10H
charge 0 multiplicity 1
30 atoms
Cl 8.006984 -0.716741 -0.037283
S  -1.462314 -1.216409 0.168929
N  -2.111734 1.303981 -0.434027
N  1.138465 -0.252231 -0.063239
N  -0.726321 1.29115 -0.420699
C  -4.127834 -0.092717 -0.094407
C  -2.67872 0.115479 -0.148902
C  3.495748 0.324938 -0.02503
C  -4.994893 1.009285 -0.350897
C  -4.693057 -1.362209 0.207824
C  -6.391262 0.837746 -0.302578
C  -6.092276 -1.527075 0.254877
C  4.47446 1.357888 0.021476
C  3.922445 -1.034504 -0.076249
C  -6.947199 -0.428993 0.000318
C  2.076654 0.676881 -0.018547
C  -0.19584 0.087392 -0.121046
C  5.849854 1.050376 0.017403
C  5.290882 -1.354879 -0.079621
C  6.235868 -0.304641 -0.032753
H  -4.550439 1.981549 -0.584005
H  -4.03965 -2.220372 0.405997
H  4.15618 2.406468 0.059658
H  3.159867 -1.818433 -0.11141
H  -7.049242 1.690657 -0.501079
H  -6.515558 -2.509713 0.488793
H  -8.03434 -0.558934 0.036648
H  1.817861 1.751553 0.024324
H  6.604423 1.840938 0.052211
H  5.626084 -2.395127 -0.117787
