program: Gaussian 09
title: 000259029
version: EM64L-G09RevD.01
frameworkgroup: C1[X(C21H30O3)]
method: RPBEPBE
basis: SDD
operation: Freq
keyword: #pfreq=noraman
keyword: PBEPBE/SDD
title: #p freq=noraman PBEPBE/SDD
converged: YES YES NO NO
title: Mulliken charges:
elementType: O O O C C C C C C C C C C C C C C C C C C C C C H H H H H H H H H H H H H H H H H H H H H H H H H H H H H H
charge: -0.310895 -0.268334 -0.446935 0.364364 -0.135612 -0.116230 -0.159615 -0.089756 -0.521003 -0.562698 -0.486953 -0.462723 -0.507440 -0.818903 0.252442 -0.581308 0.302866 -0.372960 -0.247609 -0.548068 -0.415557 0.318967 -0.328459 -0.535972 0.210094 0.241477 0.202745 0.206795 0.195694 0.213389 0.211605 0.231390 0.224511 0.193073 0.223729 0.208719 0.219984 0.214993 0.244188 0.219827 0.224668 0.222375 0.226758 0.219656 0.191988 0.200358 0.254076 0.238039 0.208036 0.199608 0.350440 0.218939 0.242564 0.218670
chargesum: 0.00000
title: Mulliken charges with hydrogens summed into heavy atoms:
elementType: O O O C C C C C C C C C C C C C C C C C C C C C
charge: -0.310895 -0.268334 -0.096494 0.364364 0.074482 0.125247 0.043130 0.117039 -0.111920 -0.119702 -0.069369 -0.030275 -0.072462 -0.130220 0.252442 -0.132175 0.302866 -0.153304 0.144737 -0.293992 -0.177518 0.318967 0.079185 0.144202
polarizability: 3.22576205e+02 -1.25444886e+01 2.23647967e+02 6.94121049e+00 4.17193130e+00 1.55272736e+02
1716.lowfreq: -1.0311 -0.0007 0.0004 0.0005 4.6385 9.3131 29.5860 31.9939 38.1829
frequency: 29.1003 31.6928 38.1770 56.4971 72.4245 92.0345 99.5430 122.4585 144.3533 147.7586 167.1704 188.8966 201.9247 214.0156 217.9503 228.7975 248.6608 268.3448 269.7901 286.2300 298.4433 322.9809 348.2380 358.9497 374.4530 401.2099 436.0556 440.5772 441.4360 471.4492 482.3389 485.6451 503.7876 531.0824 544.9056 561.3386 572.0319 608.9249 623.9556 648.1312 710.2074 714.5800 728.4019 775.2468 806.5742 817.9131 824.2109 842.0799 848.2103 857.4339 871.5923 875.5323 892.3948 906.8118 923.9944 932.2246 949.1486 968.9676 983.4845 990.0456 1002.6804 1012.7799 1016.6806 1022.0799 1032.9431 1040.5707 1059.0984 1063.9169 1076.0729 1085.8899 1098.5908 1105.5222 1113.4929 1120.7283 1134.5813 1136.6652 1146.3725 1163.6834 1173.9831 1181.8697 1182.7637 1189.9285 1204.4806 1206.1175 1211.1675 1217.8219 1234.2770 1242.3662 1249.7187 1253.2043 1262.6062 1276.3350 1280.1326 1286.4681 1296.0638 1302.7061 1316.4032 1323.4971 1326.4388 1329.6230 1332.3384 1335.7631 1345.6937 1351.1005 1370.6228 1375.7355 1380.7311 1385.3609 1396.2775 1422.7797 1438.3939 1455.3555 1456.8973 1462.4350 1464.1188 1465.3905 1466.4868 1469.7340 1471.6201 1475.5371 1478.6662 1490.8549 1493.2230 1495.0220 1576.6631 1624.9470 2894.5551 2899.9060 2911.3160 2938.8382 2954.5602 2955.9669 2957.6677 2958.4827 2965.6125 2970.7064 2983.8173 2992.6650 2996.3722 3002.2896 3008.8366 3019.5837 3022.3750 3034.7861 3040.8293 3041.7930 3047.1506 3071.8012 3078.0439 3086.0824 3092.9247 3121.0667 3136.4886 3138.2995 3162.4838 3527.5565
redmass: 4.3855 4.2767 5.1609 3.2803 3.6261 3.2655 4.3936 2.4788 3.2156 3.3732 2.0771 3.6507 2.2504 2.1358 2.3022 1.3844 1.7362 2.5116 2.3852 2.6406 3.2382 2.9794 3.4707 2.5158 2.9431 3.7420 3.8520 2.6713 2.6842 2.1780 1.5556 2.9230 3.3388 2.9354 4.3358 2.9573 2.8240 3.7858 2.6903 2.9734 4.6012 3.3919 2.2200 2.3694 1.7907 1.9212 1.9262 2.1015 1.7875 1.9855 2.7527 3.1466 1.6780 2.1236 1.8827 1.4288 1.9805 2.1153 2.4958 2.2895 3.6342 2.3149 2.1022 2.4918 2.5227 2.0710 2.4993 3.7445 2.7220 1.7794 1.9099 2.2810 1.2606 2.0335 1.5947 1.7041 1.5156 1.8081 1.4623 1.4295 1.7173 1.2132 1.6425 1.3476 1.1897 1.7943 1.4678 1.4978 2.0652 1.8599 1.5734 1.3767 1.3700 1.3533 1.5210 1.4032 1.3499 1.2923 1.2762 1.4078 1.4695 1.3744 1.4542 1.5097 1.7917 2.8791 1.5119 1.3160 1.2412 3.1663 1.2551 1.1238 1.0807 1.0812 1.0904 1.0805 1.0502 1.0911 1.0839 1.0777 1.0821 1.0716 1.0627 2.5003 7.1740 6.8220 1.0814 1.0800 1.0828 1.0554 1.0629 1.0333 1.0648 1.0759 1.0705 1.0695 1.0611 1.0590 1.0382 1.0992 1.0652 1.0937 1.0963 1.1012 1.1023 1.1037 1.1030 1.1040 1.0966 1.0983 1.0992 1.0991 1.0895 1.0882 1.0949 1.0650
irintensity: 0.0338 2.0648 1.8233 0.1039 0.7596 6.3536 0.7744 1.6015 0.9710 5.3246 0.1346 1.0689 3.5060 1.4298 0.8051 0.0181 0.1852 1.8278 0.7560 2.1709 3.0690 1.2140 1.0077 0.5954 2.5371 1.5879 0.8088 18.8917 2.2948 47.0304 109.7073 1.4044 0.5016 3.6578 15.4703 2.1749 2.3002 3.5508 0.4407 6.2124 3.6170 2.6122 0.9535 12.1793 22.6701 8.0792 1.0243 1.5815 1.8518 17.2251 16.1915 2.3127 30.8350 1.4030 2.0113 0.2388 3.3929 18.9687 22.9540 2.8452 41.7627 47.8201 50.5332 36.5676 32.6423 15.4000 19.3687 102.6303 10.7285 17.1003 5.6392 10.4431 0.1897 14.7465 19.2300 4.5384 6.7418 13.4955 4.7788 12.0393 24.3949 9.5678 9.2261 12.8237 1.4398 25.6848 3.5268 29.4003 66.0563 38.4963 0.9756 11.8919 2.8361 2.7094 1.0582 0.7168 11.6646 21.4446 6.2296 3.1863 1.7832 8.0636 1.0215 3.5032 6.4724 5.4866 2.6435 26.7787 24.0205 27.1029 2.2248 11.3862 3.3104 8.7169 0.1892 14.1619 12.6727 6.2821 11.0668 52.6111 3.8960 8.8137 6.5400 113.0066 24.6754 71.6349 5.6514 7.1937 59.7466 56.9326 43.2383 79.4819 21.1530 11.2374 37.1217 51.9396 26.2474 32.0321 28.1281 49.8898 69.5459 44.2765 35.3597 43.2203 58.0253 59.5770 5.9481 62.7929 47.1137 27.5944 26.5282 30.9387 18.5346 1.7972 18.8100 12.0413
temp: 298.150 k
press: 1.00000 atm
elementType: 8 8 8 6 6 6 6 6 6 6 6 6 6 6 6 6 6 6 6 6 6 6 6 6 1 1 1 1 1 1 1 1 1 1 1 1 1 1 1 1 1 1 1 1 1 1 1 1 1 1 1 1 1 1
symmnumber: 1
zpe: 1227821.6 jmol-1
zpe.correction: 0.467653 hartree
zpe.thermalcorrener: 0.490774 hartree
zpe.thermalcorrenthalpy: 0.491718 hartree
zpe.thermalcorrgfe: 0.415401 hartree
zpe.sumelectzpe: -1042.034474 hartree
zpe.sumelectthermal: -1042.011353 hartree
zpe.sumelectthermalent: -1042.010409 hartree
zpe.sumelectthermalfe: -1042.086725 hartree
dipole: 1.0000 1.6354 -0.5968
dipole: 2.0077
quadrupole: -147.1275 -144.2701 -146.5557
quadrupole: -29.9914 0.3232 -0.6258
quadrupole: -1.1431 1.7143 -0.5713 -29.9914 0.3232 -0.6258
hfenergy: -1042.5021266 hartree
pointgroup: C01 [X(C21H30O3)]
dipole: -0.398368 -0.6422437 -0.2296482 debye
polarizability: 322.3861094|-13.4338257|223.7841854|-6.4848013|-4.784364|155.3266135 unknown
InChI: InChI=1S/C21H30O3/c1-21-10-9-17-16-6-4-15(23-2)13-14(16)3-5-18(17)19(21)7-8-20(21)24-12-11-22/h4,6,13,17-20,22H,3,5,7-12H2,1-2H3
charge 0 multiplicity 1
54 atoms
O  4.632889 0.381954 0.294378
O  -6.465828 0.498369 0.297818
O  6.323002 2.596842 -0.118938
C  2.171987 0.000212 0.18843
C  1.341214 -1.216869 -0.332028
C  -0.14296 -1.128276 0.062379
C  -0.739876 0.174815 -0.559687
C  3.573946 -0.422179 -0.327427
C  1.596461 1.290568 -0.439992
C  2.183602 -2.454774 0.079334
C  0.076608 1.437358 -0.153764
C  3.667797 -1.954376 -0.015754
C  -0.978622 -2.341648 -0.398353
C  2.200906 0.11337 1.735972
C  -2.249172 0.290717 -0.289179
C  -2.408947 -2.249893 0.17106
C  -3.035458 -0.865721 0.011972
C  -2.918292 1.534876 -0.388148
C  5.966125 0.163619 -0.290926
C  -4.428746 -0.73898 0.196899
C  -4.311866 1.668737 -0.201176
C  -5.073491 0.513711 0.093903
C  6.847173 1.283591 0.265798
C  -7.172885 1.774971 0.191363
H  1.374109 -1.161433 -1.446352
H  -0.222575 -1.06697 1.169234
H  -0.61266 0.060722 -1.662837
H  3.615676 -0.260481 -1.43058
H  1.754427 1.257686 -1.539078
H  2.133711 2.182915 -0.063479
H  1.995149 -3.320589 -0.579662
H  1.938209 -2.772316 1.110329
H  -0.096154 1.65367 0.918593
H  -0.291724 2.319306 -0.710797
H  4.198695 -2.092122 0.944638
H  4.236659 -2.497821 -0.791013
H  -0.507256 -3.28623 -0.066076
H  -1.008067 -2.364151 -1.507558
H  2.924618 0.891572 2.0327
H  1.213945 0.385068 2.146416
H  2.515447 -0.829154 2.217562
H  -2.378289 -2.499731 1.252522
H  -3.063874 -3.008526 -0.299047
H  -2.346327 2.438951 -0.621376
H  6.362991 -0.835178 -0.011101
H  5.904696 0.234354 -1.398855
H  -5.041121 -1.619003 0.424584
H  -4.77812 2.654574 -0.289404
H  7.864154 1.222744 -0.157163
H  6.908003 1.189269 1.370628
H  5.350611 2.574068 0.083973
H  -6.812838 2.501429 0.946389
H  -8.229614 1.536185 0.382628
H  -7.067348 2.212896 -0.820854
