program: Gaussian 09
title: 000259007
version: EM64L-G09RevD.01
frameworkgroup: C1[X(C17H19N3O4)]
method: RPBEPBE
basis: SDD
operation: Freq
keyword: #p
keyword: freq=noraman
keyword: PBEPBE/SDD
title: #p freq=noraman PBEPBE/SDD
converged: YES YES NO NO
title: Mulliken charges:
elementType: O O O O N N N C C C C C C C C C C C C C C C C C H H H H H H H H H H H H H H H H H H H
charge: -0.277997 -0.275040 -0.432793 -0.344115 -0.378278 -0.378834 -0.513203 -0.193626 -0.656636 0.528199 0.213829 -0.430763 -0.360710 0.342524 -0.384196 -0.351292 0.281224 -0.479441 0.469577 -0.384872 -0.364961 -0.224677 -0.226789 -0.231096 0.278916 0.259570 0.241330 0.341354 0.237209 0.229992 0.220420 0.251379 0.378310 0.245120 0.222681 0.232513 0.269870 0.297953 0.308064 0.227202 0.228110 0.229941 0.354031
chargesum: 0.00000
title: Mulliken charges with hydrogens summed into heavy atoms:
elementType: O O O O N N N C C C C C C C C C C C C C C C C C
charge: -0.277997 -0.275040 -0.078762 -0.344115 -0.036924 -0.000524 0.092814 0.085291 -0.155736 0.528199 0.213829 -0.193554 -0.130717 0.342524 -0.163776 -0.099913 0.281224 -0.011640 0.469577 -0.152359 -0.095091 0.002525 0.001321 -0.001155
polarizability: 2.24886760e+02 5.09100562e+01 2.18272577e+02 1.07105308e+01 -1.50573221e+01 1.91292564e+02
1716.lowfreq: -8.4600 -5.2753 -2.5590 -0.0010 -0.0007 -0.0005 10.1384 13.3708 17.3630
frequency: 9.1723 13.2618 17.2684 26.2588 37.1065 46.5771 55.7469 66.9860 76.6920 114.0545 123.9754 140.0395 151.7697 177.1632 199.2169 221.6750 260.7500 280.0069 298.0841 310.9230 323.5967 346.9144 362.6178 369.2235 401.2245 403.4974 409.5757 445.3240 481.8086 488.0466 509.8473 524.5242 539.0381 593.6247 617.1615 636.1881 655.9441 659.4293 697.1634 704.5689 713.3737 746.6703 757.9819 774.6894 789.5219 801.1024 810.6343 816.0753 825.1808 848.7359 856.6239 859.0055 870.4123 931.0945 934.9484 946.7942 960.2437 966.5887 981.1752 989.6485 996.9777 1000.3801 1003.7296 1027.0887 1033.7442 1091.3062 1099.8885 1117.4378 1128.1017 1142.4213 1173.5926 1179.3924 1181.3990 1189.4216 1216.1407 1223.2280 1228.1447 1241.1127 1249.8355 1251.5795 1279.8108 1291.2821 1312.2025 1330.5155 1335.3685 1344.7110 1352.7190 1386.1030 1391.6079 1426.7925 1442.5953 1457.0356 1461.7241 1476.0947 1484.8008 1492.5949 1507.1996 1594.5667 1596.7899 1603.9736 1614.8858 1626.6682 1628.2645 1677.2690 3000.3551 3009.1255 3038.7881 3065.2532 3109.4284 3112.9729 3120.1305 3122.3568 3128.4005 3132.9862 3140.5707 3151.5437 3165.3304 3170.5673 3353.7114 3384.3232 3500.0337 3553.5243 3582.1411
redmass: 4.0139 6.3470 3.9925 5.0159 4.7952 5.8531 8.2891 5.3359 1.4163 5.0739 4.5352 5.0681 5.7894 5.7816 3.4594 5.7302 6.2116 6.8747 2.8893 4.7030 4.3830 4.2737 1.1363 2.4173 3.1890 2.8059 2.9156 3.7723 4.1825 4.3009 4.5796 1.2751 2.8666 4.2864 6.2792 6.7766 5.0772 5.2599 6.6723 1.9513 3.4475 4.8674 2.2258 2.7649 1.6090 1.4382 1.8307 3.5224 1.8233 2.5099 1.7817 2.4088 2.1748 1.4167 1.4786 3.4957 1.4003 1.9680 1.4307 4.9221 4.1864 1.3484 2.8791 2.2168 2.4857 1.5191 1.6354 2.9537 2.2875 1.3670 1.0543 1.2866 1.3808 1.1268 2.2505 2.9243 2.2331 1.1717 2.6728 1.8828 1.3848 1.3799 1.3475 1.2566 1.2249 1.5364 1.2589 8.0148 5.6192 2.8494 2.1787 1.2414 1.1279 1.6779 2.2889 1.5817 2.7829 6.1553 6.4595 8.2285 6.0776 5.1913 6.4762 1.1005 1.0836 1.0620 1.0585 1.1005 1.0871 1.1075 1.0868 1.0900 1.0873 1.0966 1.0921 1.0964 1.1016 1.0951 1.0812 1.0458 1.0982 1.0777 1.0660
irintensity: 0.6454 0.1622 0.5131 0.1797 0.1699 0.8687 7.7761 1.3029 42.6721 6.7728 4.0701 10.1077 0.7948 2.3881 6.2842 4.4314 17.5304 11.4583 1.6502 10.1337 2.4556 29.0844 134.2237 29.5638 15.5597 0.1496 1.5309 2.3675 13.8748 2.9225 18.8298 152.0702 33.3448 7.3531 0.3225 0.8309 14.5428 10.3322 19.8658 57.0984 2.4082 9.9468 77.8381 48.0582 174.2345 73.1297 89.9123 9.6804 15.3211 34.5669 17.1079 25.4072 10.1915 5.7672 4.6612 24.5619 4.3623 24.4153 2.3631 19.1481 168.7708 0.8209 6.1175 2.4867 1.5279 8.2226 35.2739 27.7519 18.7173 193.5691 0.0297 56.1264 72.3200 0.1542 2.2368 43.3445 121.9673 16.1966 31.8499 60.0925 8.6055 0.3775 9.9350 1.7322 20.4518 2.9242 3.3149 0.8185 14.7331 7.6482 9.6126 109.8801 54.9544 257.5288 26.3071 204.8485 94.2689 3.7925 5.2753 56.3902 2.2340 367.4904 28.9636 4.6163 8.4543 11.0588 33.4476 9.1923 15.6882 4.8509 5.4570 18.5479 1.6150 12.2516 18.5624 24.7890 20.9096 4.7935 213.2407 21.7944 3.5729 47.4169 38.9697
temp: 298.150 k
press: 1.00000 atm
elementType: 8 8 8 8 7 7 7 6 6 6 6 6 6 6 6 6 6 6 6 6 6 6 6 6 1 1 1 1 1 1 1 1 1 1 1 1 1 1 1 1 1 1 1
symmnumber: 1
zpe: 889474.9 jmol-1
zpe.correction: 0.338783 hartree
zpe.thermalcorrener: 0.362066 hartree
zpe.thermalcorrenthalpy: 0.363010 hartree
zpe.thermalcorrgfe: 0.280357 hartree
zpe.sumelectzpe: -1122.605538 hartree
zpe.sumelectthermal: -1122.582255 hartree
zpe.sumelectthermalent: -1122.581311 hartree
zpe.sumelectthermalfe: -1122.663964 hartree
dipole: 2.1412 2.1377 -1.2410
dipole: 3.2703
quadrupole: -142.4040 -137.6998 -126.7424
quadrupole: 1.8720 -5.7311 -11.1733
quadrupole: -6.7886 -2.0844 8.8730 1.8720 -5.7311 -11.1733
hfenergy: -1122.9443211 hartree
pointgroup: C01 [X(C17H19N3O4)]
dipole: -0.52144 -0.9712656 -0.6634568 debye
polarizability: 181.001918|40.5686609|251.5571588|-3.7781414|16.6248322|201.8928232 unknown
InChI: InChI=1S/C17H19N3O4/c18-20-16(22)15(10-12-6-8-14(21)9-7-12)19-17(23)24-11-13-4-2-1-3-5-13/h1-9,15,19-21H,10-11,18H2
charge 0 multiplicity 1
43 atoms
O  -1.575355 1.233259 -0.905781
O  3.220496 3.540131 -0.192995
O  1.944668 -4.849211 -1.433155
O  -0.779851 1.89903 1.216192
N  0.667625 1.328237 -0.531165
N  1.489572 3.635685 1.365991
N  1.59642 5.047403 1.55016
C  1.903525 1.470561 0.266727
C  3.075897 0.71825 -0.407997
C  2.778334 -0.745442 -0.696996
C  2.283568 2.97197 0.451317
C  2.728121 -1.228059 -2.027404
C  2.547386 -1.67163 0.356227
C  -0.571394 1.510902 0.02386
C  2.453195 -2.585969 -2.309127
C  2.27174 -3.026676 0.096805
C  2.22263 -3.484047 -1.24143
C  -2.989218 1.374182 -0.403365
C  -3.511237 0.076068 0.171289
C  -4.210031 -0.843446 -0.65138
C  -3.311421 -0.2342 1.541839
C  -4.69816 -2.056904 -0.117685
C  -3.79905 -1.446928 2.076263
C  -4.49334 -2.36061 1.248476
H  1.698035 1.044206 1.267956
H  3.349354 1.258855 -1.332047
H  3.948762 0.817541 0.263353
H  0.725479 0.978229 -1.489254
H  2.921884 -0.539666 -2.859609
H  2.588255 -1.329916 1.398014
H  2.423896 -2.93704 -3.348955
H  2.094765 -3.740969 0.906205
H  0.61308 3.19241 1.688398
H  -2.998421 2.186329 0.343405
H  -3.537933 1.673789 -1.309885
H  -4.369011 -0.608687 -1.711209
H  -2.762446 0.473379 2.173202
H  2.256937 5.257846 2.312569
H  1.921024 5.478492 0.670867
H  -5.237755 -2.760799 -0.761072
H  -3.640805 -1.679026 3.135346
H  -4.872807 -3.300794 1.664522
H  1.928586 -5.074329 -2.396372
