program: Gaussian 09
title: 000023487
version: EM64L-G09RevD.01
frameworkgroup: C1[X(C17H22N2O)]
method: RPBEPBE
basis: SDD
operation: Freq
keyword: #p
keyword: freq=noraman
keyword: PBEPBE/SDD
title: #p freq=noraman PBEPBE/SDD
converged: YES YES NO NO
title: Mulliken charges:
elementType: O N N C C C C C C C C C C C C C C C C C H H H H H H H H H H H H H H H H H H H H H H
charge: -0.271967 -0.140410 -0.111843 -0.005920 -0.428351 0.291476 -0.760703 -0.204716 -0.372734 -0.631498 -0.641863 0.165006 -0.323433 -0.660593 0.487434 -0.410320 -0.384422 -0.225380 -0.224191 -0.245384 0.234740 0.218873 0.263868 0.206732 0.244547 0.237586 0.261686 0.241265 0.237352 0.187221 0.221835 0.217427 0.190121 0.266167 0.249040 0.247578 0.213678 0.220309 0.263542 0.224239 0.224612 0.227394
chargesum: 0.00000
title: Mulliken charges with hydrogens summed into heavy atoms:
elementType: O N N C C C C C C C C C C C C C C C C C
charge: -0.271967 -0.140410 -0.111843 0.228820 0.054390 0.291476 -0.071839 0.056970 -0.131469 0.014911 0.031852 0.165006 -0.074393 -0.199337 0.487434 -0.190011 -0.120880 -0.001141 0.000421 -0.017990
polarizability: 2.10468569e+02 -1.72810741e+00 2.21399051e+02 1.30741403e+01 -1.55871905e+01 1.58908023e+02
1716.lowfreq: -9.2869 -3.5454 -0.0007 -0.0005 0.0006 4.1680 10.6093 21.6869 27.6814
frequency: 7.4646 21.4571 27.4185 46.6277 61.8498 79.0992 94.7823 115.5140 165.0070 187.6061 199.7627 210.3363 224.8700 246.9847 279.9374 291.1990 308.2212 314.7917 359.7409 364.5757 403.5992 408.4879 425.3849 449.4471 469.1245 481.5985 505.6746 511.9865 599.9519 607.7622 618.5422 653.1753 703.2477 717.1028 722.2502 751.8832 764.0337 777.3007 808.7707 837.0684 853.7300 863.3215 875.0332 886.9512 900.7441 918.3660 924.2177 972.0088 977.5263 987.3667 992.8454 997.1484 1026.4093 1037.1306 1049.6408 1071.1238 1081.8385 1086.9839 1088.0119 1108.5370 1110.6903 1135.9731 1155.0026 1171.6452 1188.2528 1196.9403 1199.5638 1213.2367 1229.5606 1240.0069 1268.6647 1272.9560 1313.0035 1327.7108 1329.8654 1342.6062 1362.8279 1379.4768 1382.4219 1390.4901 1424.8090 1427.6790 1434.7138 1440.2269 1451.3119 1458.1468 1463.4630 1465.1148 1473.6100 1477.5960 1481.7300 1486.7267 1488.4796 1497.3658 1509.7803 1562.3521 1592.9164 1611.1909 2851.0794 2868.7621 2892.0727 2981.7052 3016.9949 3024.4201 3026.3532 3035.1325 3077.4698 3083.2951 3088.6136 3095.6197 3106.6537 3115.0964 3122.7998 3123.6124 3136.0261 3146.5046 3162.4289 3209.3296 3220.6369 3241.2252
redmass: 4.2181 4.8171 3.8615 3.2587 2.9393 3.9929 4.5335 5.9068 4.4031 4.1982 1.5123 3.4766 1.4548 1.5422 3.2310 2.2722 2.6046 1.6694 2.3474 2.2899 2.8271 2.8238 2.4180 2.5091 3.1411 2.4564 4.5550 4.5953 3.9237 3.2718 5.7215 4.1457 2.0970 3.9979 2.2190 1.3045 2.6221 2.7969 1.8051 2.7198 1.2549 2.7058 3.6532 1.3787 1.5028 1.7635 1.8841 2.1630 1.3885 3.1514 2.3368 1.5428 2.2384 1.6388 1.5715 1.5141 1.5416 1.5430 1.3821 1.6368 2.4098 1.4189 1.3611 1.0563 1.1229 2.2438 2.2196 2.5968 2.2886 1.7427 1.4189 2.6465 1.3722 1.3240 1.5259 2.1527 1.4494 3.6389 5.7487 1.2536 1.4021 2.4698 1.4828 2.1858 1.2358 1.7022 1.1282 1.1876 1.0611 1.0777 2.0962 1.0542 1.0518 1.0561 3.6968 7.3767 6.0379 6.0839 1.0583 1.0584 1.0812 1.0373 1.0601 1.0746 1.0753 1.0638 1.0979 1.1016 1.0991 1.0968 1.0984 1.0866 1.1009 1.0864 1.0917 1.0962 1.1016 1.0897 1.0967 1.1087
irintensity: 0.0443 0.8573 0.0548 0.8501 1.4510 0.9302 1.2782 2.6188 0.3149 2.0563 0.3578 3.7211 0.5830 0.5681 1.3789 7.2812 5.3616 4.3081 2.4992 1.5114 0.0430 0.7898 3.3287 1.9900 3.0103 1.6349 4.6488 10.9544 13.2291 14.1044 3.7352 23.4393 36.2360 40.4508 32.2178 103.1143 4.9487 4.6783 0.4924 1.6419 0.8468 0.5249 5.4777 0.3152 4.2505 11.6765 14.3175 24.0820 0.6930 10.3497 6.7815 10.7043 9.4364 12.1716 13.7352 23.9050 3.2215 38.9827 23.6255 38.2421 3.7585 7.2692 6.1848 0.2189 1.2552 9.6531 12.1408 10.6241 54.1007 2.4771 29.8580 23.9276 10.8506 0.4328 5.9113 34.6166 32.0279 22.9839 9.6252 31.3462 25.3600 45.7327 23.5428 9.1960 5.9156 67.6983 34.5771 21.6609 34.0756 38.6208 15.1099 13.7933 2.9581 13.6304 5.3013 225.5537 0.5199 13.5523 101.0400 116.0481 67.6464 20.5619 18.2430 28.5432 74.9616 39.5171 33.7789 9.3892 30.2962 24.5958 12.6189 10.1678 3.1150 0.2898 19.6153 30.1696 23.1103 2.3121 4.9506 2.6859
temp: 298.150 k
press: 1.00000 atm
elementType: 8 7 7 6 6 6 6 6 6 6 6 6 6 6 6 6 6 6 6 6 1 1 1 1 1 1 1 1 1 1 1 1 1 1 1 1 1 1 1 1 1 1
symmnumber: 1
zpe: 927743.0 jmol-1
zpe.correction: 0.353359 hartree
zpe.thermalcorrener: 0.373080 hartree
zpe.thermalcorrenthalpy: 0.374024 hartree
zpe.thermalcorrgfe: 0.302099 hartree
zpe.sumelectzpe: -844.223097 hartree
zpe.sumelectthermal: -844.203376 hartree
zpe.sumelectthermalent: -844.202432 hartree
zpe.sumelectthermalfe: -844.274357 hartree
dipole: 0.1977 1.0282 -2.1342
dipole: 2.3771
quadrupole: -114.6203 -110.0524 -122.2624
quadrupole: -2.0063 -1.2391 0.1822
quadrupole: 1.0247 5.5927 -6.6174 -2.0063 -1.2391 0.1822
hfenergy: -844.5764561 hartree
pointgroup: C01 [X(C17H22N2O1)]
dipole: -0.2856988 0.0862176 0.8863475 debye
polarizability: 210.347605|-6.2464761|205.2629285|6.6170641|32.9595946|175.1651095 unknown
InChI: InChI=1S/C17H22N2O/c1-14(18(2)3)13-19-11-7-10-16(19)17(20)12-15-8-5-4-6-9-15/h4-11,14H,12-13H2,1-3H3
charge 0 multiplicity 1
42 atoms
O  0.015036 0.163994 -1.851869
N  -2.078498 0.939774 0.099492
N  -2.514553 -2.67719 -0.960172
C  -2.083032 -1.60576 -0.011101
C  -2.60172 -0.256039 -0.60232
C  -0.792364 1.522094 -0.027595
C  -2.610638 -1.798363 1.423021
C  -2.782172 1.628526 1.07015
C  -0.732913 2.597764 0.901178
C  -2.804476 -4.006761 -0.388331
C  -1.597046 -2.801626 -2.118732
C  0.215486 1.089342 -0.992992
C  -1.976421 2.665153 1.584589
C  1.599197 1.76601 -0.941315
C  2.568849 0.976154 -0.058902
C  3.134836 1.554123 1.104565
C  2.915435 -0.358026 -0.39843
C  4.033876 0.819341 1.911791
C  3.811978 -1.093434 0.407287
C  4.375939 -0.507603 1.565481
H  -0.968285 -1.553105 0.032459
H  -3.703163 -0.24433 -0.522263
H  -2.320144 -0.189051 -1.66204
H  -3.715316 -1.86207 1.440269
H  -2.305922 -0.940091 2.047174
H  -2.19998 -2.70879 1.891547
H  -3.801862 1.343218 1.324615
H  0.120446 3.257156 1.048056
H  -3.572491 -3.944101 0.398657
H  -1.905895 -4.522433 0.03731
H  -3.205548 -4.650842 -1.192591
H  -2.089522 -3.378292 -2.922896
H  -0.643507 -3.322084 -1.850241
H  -1.321968 -1.809709 -2.509562
H  -2.268488 3.376745 2.354425
H  1.967719 1.781481 -1.98311
H  1.525745 2.808057 -0.58962
H  2.876714 2.584712 1.379048
H  2.473358 -0.812342 -1.292835
H  4.466052 1.282038 2.806449
H  4.07323 -2.121681 0.131771
H  5.073729 -1.07786 2.188982
