program: Gaussian 09
title: 000258974
version: EM64L-G09RevD.01
frameworkgroup: C1[X(C14H19N3)]
method: RPBEPBE
basis: SDD
operation: Freq
keyword: #pfreq=noraman
keyword: PBEPBE/SDD
title: #p freq=noraman PBEPBE/SDD
converged: YES YES NO NO
title: Mulliken charges:
elementType: N N N C C C C C C C C C C C C C C H H H H H H H H H H H H H H H H H H H
charge: -0.114294 -0.166439 -0.013172 -0.377839 -0.377986 0.310757 -0.387055 -0.386666 -0.723605 -0.723943 0.478073 -0.223884 -0.368389 -0.368428 -0.238688 -0.238611 -0.269884 0.212002 0.217378 0.217494 0.212537 0.208571 0.214965 0.215034 0.208380 0.230841 0.229174 0.237420 0.231097 0.229154 0.237588 0.213024 0.212624 0.218354 0.218371 0.226046
chargesum: 0.00000
title: Mulliken charges with hydrogens summed into heavy atoms:
elementType: N N N C C C C C C C C C C C C C C
charge: -0.114294 -0.166439 -0.013172 0.051541 0.052045 0.310757 0.036481 0.036749 -0.026170 -0.026104 0.478073 -0.223884 -0.155365 -0.155805 -0.020334 -0.020240 -0.043838
polarizability: 2.39562457e+02 -1.21002935e-02 1.53321746e+02 -1.33388983e+00 -6.37790711e-02 1.18195240e+02
1716.lowfreq: -35.4228 -0.0003 0.0002 0.0003 1.6553 3.4203 10.9287 25.2324 48.9341
frequency: -35.1439 25.2040 48.7013 90.1422 115.7453 135.8537 168.2544 188.2808 191.4499 214.1391 230.7447 261.6641 278.5316 286.1505 352.5915 392.5080 398.4898 404.0433 423.3573 437.7823 457.1572 473.4968 505.1060 564.5862 592.1666 614.4299 624.4124 681.6304 683.1210 721.4022 736.8829 755.3104 801.0009 845.5644 864.9497 898.2245 922.3681 940.4620 953.4073 966.5927 972.2468 974.9719 976.7982 1009.4730 1033.0715 1048.7981 1053.6272 1089.0740 1090.3867 1108.0170 1139.2062 1165.7573 1170.5811 1171.9713 1200.0447 1204.2665 1208.4894 1229.3172 1247.2961 1288.3469 1310.0497 1328.3146 1349.1321 1353.0676 1358.9656 1376.2111 1379.9747 1385.2412 1391.5988 1394.8302 1445.9109 1451.5781 1459.4784 1463.1580 1463.3824 1470.0895 1477.9678 1479.3002 1496.7864 1501.8936 1578.2693 1618.3735 2155.7420 2894.6778 2899.2819 2916.7744 2922.0976 3001.3966 3003.9018 3066.4821 3068.7096 3077.8706 3081.3314 3102.6126 3109.4741 3110.7444 3114.0509 3122.1483 3129.0367 3155.9039 3163.6493 3172.6241
redmass: 3.2869 5.1160 3.2980 6.5495 3.5909 4.1195 3.8767 2.5942 1.3683 1.9715 2.3074 1.7779 1.9278 2.5762 2.3439 3.6351 2.3225 2.8532 3.2015 3.8493 3.4435 2.8503 2.6859 4.9679 4.6060 6.2889 4.0488 3.0913 1.7820 3.7194 2.8450 1.9229 1.2809 1.5705 1.5243 3.5580 2.8203 1.4516 1.3683 2.0778 2.6010 1.4381 3.4700 1.3850 2.1472 2.5480 1.8021 2.3838 1.6431 1.9720 4.6462 2.1517 2.7844 1.1194 2.2666 1.2441 1.3345 2.5587 1.4715 1.3633 1.3616 1.3646 1.5702 1.9699 1.2802 1.1969 1.4909 3.2959 1.3007 1.2164 2.3716 1.0618 1.1221 1.0953 1.0719 1.0904 1.0753 1.0474 2.2220 1.0671 5.8910 6.1104 12.6787 1.0719 1.0705 1.0695 1.0697 1.0350 1.0356 1.0895 1.0914 1.0882 1.0896 1.1005 1.0998 1.1000 1.0994 1.0846 1.0892 1.0926 1.0927 1.0984
irintensity: 0.0786 0.7129 2.5291 1.0637 0.1900 4.4358 0.9055 3.9438 0.1083 0.7666 1.5493 1.6148 0.0709 19.9248 1.0102 0.1518 0.2546 0.0357 2.1075 1.7811 3.2236 0.1373 17.4616 0.8990 11.3827 0.0906 1.5792 1.8138 38.5925 5.7147 11.5563 85.1224 0.0028 0.0179 4.5694 1.3090 37.9608 1.4494 0.0175 0.8118 18.1353 0.3056 52.8976 0.6756 16.6371 9.1378 0.3118 0.1162 4.7183 10.5901 6.5411 135.5928 28.2752 1.0545 40.6002 5.5631 0.0884 0.0102 154.9435 41.9796 17.4843 0.2709 0.2171 41.0009 13.2910 12.4755 20.6354 4.6578 2.2323 28.7726 0.1297 7.1526 0.2754 70.5406 7.0284 25.7613 2.4851 5.2487 147.1169 14.8405 10.8456 170.9240 5.1149 43.5639 23.0046 21.5036 137.3866 13.1870 12.9426 17.5743 24.0963 34.8225 21.0974 3.4040 38.5604 23.4440 20.3266 8.1343 13.3407 44.5933 40.2482 1.2842
temp: 298.150 k
press: 1.00000 atm
elementType: 7 7 7 6 6 6 6 6 6 6 6 6 6 6 6 6 6 1 1 1 1 1 1 1 1 1 1 1 1 1 1 1 1 1 1 1
symmnumber: 1
zpe: 798087.0 jmol-1
zpe.correction: 0.303975 hartree
zpe.thermalcorrener: 0.319676 hartree
zpe.thermalcorrenthalpy: 0.320620 hartree
zpe.thermalcorrgfe: 0.261014 hartree
zpe.sumelectzpe: -707.828679 hartree
zpe.sumelectthermal: -707.812978 hartree
zpe.sumelectthermalent: -707.812034 hartree
zpe.sumelectthermalfe: -707.871640 hartree
dipole: 0.8938 0.0269 -3.7039
dipole: 3.8103
quadrupole: -107.1558 -91.4527 -117.0419
quadrupole: 0.1132 -15.0890 0.1129
quadrupole: -1.9390 13.7641 -11.8251 0.1132 -15.0890 0.1129
hfenergy: -708.132654 hartree
pointgroup: C01 [X(C14H19N3)]
dipole: -0.3204671 0.8527285 1.1905542 debye
polarizability: 239.4238814|-3.4997214|141.9625017|-2.3129872|-16.4130717|129.6930599 unknown
InChI: InChI=1S/C14H19N3/c1-14(2,12-15)17-10-8-16(9-11-17)13-6-4-3-5-7-13/h3-7H,8-11H2,1-2H3
charge 0 multiplicity 1
36 atoms
N  -1.981621 0.362604 0.387404
N  0.896305 0.025887 0.001476
N  -4.103927 -1.210473 -1.891262
C  -1.277006 1.013212 -0.751527
C  -1.321018 -0.947991 0.637446
C  -3.476938 0.30236 0.256284
C  0.201407 1.262425 -0.407995
C  0.156444 -0.750163 1.016484
C  -4.062039 1.730961 0.072478
C  -4.107303 -0.323663 1.532538
C  2.314384 -0.017857 -0.015396
C  -3.87257 -0.534374 -0.93374
C  3.084311 0.949993 -0.735559
C  3.038895 -1.049664 0.661925
C  4.489921 0.864221 -0.799306
C  4.444733 -1.122799 0.589696
C  5.190753 -0.172741 -0.143468
H  -1.735496 1.991425 -0.96648
H  -1.340055 0.38639 -1.67355
H  -1.386119 -1.60819 -0.260827
H  -1.811547 -1.460689 1.479875
H  0.676387 1.672936 -1.313749
H  0.264697 2.034478 0.39296
H  0.21391 -0.253699 2.012364
H  0.600387 -1.75417 1.111968
H  -3.794599 2.179822 -0.897294
H  -5.162874 1.692202 0.126688
H  -3.683599 2.373812 0.886177
H  -3.883531 -1.397212 1.637401
H  -5.204285 -0.216499 1.496327
H  -3.721574 0.214644 2.41581
H  2.598372 1.781048 -1.253135
H  2.516808 -1.807014 1.25227
H  5.040525 1.624275 -1.366234
H  4.959643 -1.932914 1.119657
H  6.28262 -0.232982 -0.194106
