program: Gaussian 09
title: 000258978
version: EM64L-G09RevD.01
frameworkgroup: C1[X(C14H20ClN3O)]
method: RPBEPBE
basis: SDD
operation: Freq
keyword: #p
keyword: freq=noraman
keyword: PBEPBE/SDD
title: #p freq=noraman PBEPBE/SDD
converged: YES YES NO NO
title: Mulliken charges:
elementType: Cl O N N N C C C C C C C C C C C C C C H H H H H H H H H H H H H H H H H H H H
charge: -0.062188 -0.254072 -0.190635 -0.160463 -0.606281 0.273605 -0.379804 -0.380480 -0.420401 -0.417651 -0.739946 -0.765139 0.140931 0.538041 -0.300647 -0.339459 -0.221256 -0.242702 -0.245728 0.227862 0.198156 0.221694 0.233163 0.230472 0.192548 0.201695 0.237839 0.236426 0.206010 0.254109 0.223484 0.225689 0.255809 0.247443 0.344367 0.323189 0.252756 0.227209 0.234351
chargesum: 0.00000
title: Mulliken charges with hydrogens summed into heavy atoms:
elementType: Cl O N N N C C C C C C C C C C C C C C
charge: -0.062188 -0.254072 -0.190635 -0.160463 0.061275 0.273605 0.046214 0.074377 0.002620 0.021883 -0.043402 -0.060156 0.140931 0.538041 -0.300647 -0.092016 0.031500 -0.015493 -0.011377
polarizability: 2.51718378e+02 1.42151397e+01 1.76380924e+02 -7.72879542e+00 -5.55472427e+00 1.27925635e+02
1716.lowfreq: -7.5477 0.0009 0.0022 0.0024 4.1162 8.5299 30.1707 42.2069 58.9062
frequency: 30.1114 42.1380 58.9022 82.8287 95.2923 111.2318 147.7211 178.6862 188.3136 204.8876 229.5641 241.1032 253.1355 279.0618 298.7128 307.0414 313.0304 338.4612 356.5612 362.6562 396.9924 430.2374 446.7521 459.9901 471.4297 491.8928 513.1057 549.1422 575.7356 580.9406 619.7573 656.7104 691.4553 712.6076 719.0127 732.6030 739.3665 753.0331 761.3293 842.1997 855.5308 893.0111 923.5232 929.0857 930.1546 958.5330 970.5205 971.3960 998.9775 1008.7810 1038.8795 1051.2604 1063.1273 1065.1176 1079.1219 1101.8862 1120.7898 1134.1636 1159.1450 1172.4169 1177.0732 1190.8182 1198.4017 1214.7424 1236.9717 1260.7863 1282.1772 1304.8865 1323.7643 1344.2886 1350.8760 1356.1040 1367.5106 1372.0247 1378.4927 1382.0835 1392.5349 1428.2119 1455.4318 1456.6387 1458.6676 1461.2148 1466.5694 1476.0989 1480.2189 1483.5563 1489.8593 1526.4528 1560.7567 1606.0645 1638.9400 2883.5451 2899.2301 2903.5630 2933.0411 2985.4244 2994.8337 3051.9991 3053.1373 3074.7735 3084.5467 3090.2347 3094.4399 3096.3636 3108.4236 3133.7731 3150.8253 3160.6073 3175.0185 3442.4593 3643.9898
redmass: 6.1391 4.5940 6.9070 5.0971 4.6756 3.2416 4.4169 1.7555 2.7613 2.9951 3.5686 2.4739 3.8745 2.0335 1.2996 2.7142 2.4895 2.8128 2.8837 4.0571 2.7185 3.9383 3.3802 3.0183 3.1111 4.0199 2.8458 3.6001 2.1864 1.7522 3.3027 5.1836 2.6911 3.6332 1.8949 3.6596 1.7664 1.3559 2.4133 1.4103 1.5334 2.8967 2.9242 1.4152 1.5599 2.1051 1.8216 1.5963 1.3400 6.3236 2.5008 1.7776 2.0524 1.9500 2.2601 2.1063 1.8289 4.7955 2.7783 1.1392 2.4798 2.4580 1.4252 1.8675 1.5365 1.4690 1.4194 1.3704 2.8001 1.4107 1.5313 1.7095 2.2994 1.4835 1.3991 1.4250 1.2092 2.4372 1.0955 1.0591 1.0913 1.1357 1.0736 1.0991 2.3728 1.0631 1.0640 1.2766 5.9348 6.8467 7.3962 1.0695 1.0716 1.0699 1.0672 1.0351 1.0369 1.0910 1.0933 1.0901 1.0993 1.0991 1.0993 1.0892 1.0984 1.0855 1.0893 1.0944 1.1004 1.0482 1.1000
irintensity: 0.6928 0.9382 2.2699 3.0005 2.4400 1.6521 1.9486 0.2246 0.3254 1.5215 1.1653 5.3292 4.7025 7.2627 3.6737 8.8048 0.3526 2.7542 3.2040 6.9473 3.0110 8.8455 5.6200 4.1734 2.2206 1.0448 8.1905 4.4808 79.4123 109.6839 3.3645 19.7398 5.4870 3.5665 75.7137 8.3981 2.9252 83.6753 15.2417 0.7630 0.6545 2.6938 23.3697 1.3126 10.9260 4.2101 35.9608 25.7034 4.8941 46.0057 32.4247 2.3540 2.3150 4.3122 1.1479 3.9692 9.9872 20.7609 18.0962 7.5357 75.0961 99.8714 1.6087 8.8879 66.9936 20.1911 34.4474 21.5051 33.1955 3.2488 4.4770 13.4688 24.8409 12.7499 35.6943 20.5406 33.4973 11.3134 13.2931 2.5341 19.0181 57.3784 9.1122 12.7762 108.6166 6.9930 5.7277 164.7375 2.1780 78.1429 270.4952 48.7483 49.0165 102.1408 63.2857 18.3836 20.8830 35.2949 16.1179 31.4478 12.0399 30.3508 19.5267 5.6021 22.9293 5.6350 9.2974 16.5377 14.4287 76.8204 76.5217
temp: 298.150 k
press: 1.00000 atm
elementType: 17 8 7 7 7 6 6 6 6 6 6 6 6 6 6 6 6 6 6 1 1 1 1 1 1 1 1 1 1 1 1 1 1 1 1 1 1 1 1
symmnumber: 1
zpe: 847982.5 jmol-1
zpe.correction: 0.322979 hartree
zpe.thermalcorrener: 0.341599 hartree
zpe.thermalcorrenthalpy: 0.342543 hartree
zpe.thermalcorrgfe: 0.276378 hartree
zpe.sumelectzpe: -1243.579740 hartree
zpe.sumelectthermal: -1243.561120 hartree
zpe.sumelectthermalent: -1243.560176 hartree
zpe.sumelectthermalfe: -1243.626341 hartree
dipole: -2.7200 -3.8311 0.4361
dipole: 4.7187
quadrupole: -139.3163 -118.3009 -116.6980
quadrupole: -6.0257 -4.6787 -0.4501
quadrupole: -14.5445 6.4708 8.0737 -6.0257 -4.6787 -0.4501
hfenergy: -1243.9027195 hartree
pointgroup: C01 [X(C14H20Cl1N3O1)]
dipole: 1.1338582 1.430599 -0.3380144 debye
polarizability: 252.2983765|14.0017762|172.767834|7.0655224|-11.7756788|130.9587262 unknown
InChI: InChI=1S/C14H20ClN3O/c1-14(2,13(16)19)18-9-7-17(8-10-18)12-6-4-3-5-11(12)15/h3-6H,7-10,16H2,1-2H3
charge 0 multiplicity 1
39 atoms
Cl 2.503957 -2.543462 0.659888
O  -5.199621 -0.521297 0.980849
N  -1.857912 0.244818 -0.285983
N  1.034589 0.13034 -0.132108
N  -3.56943 1.017031 1.629397
C  -3.307703 -0.072197 -0.570688
C  -1.01025 0.577329 -1.459928
C  -1.165859 -0.792846 0.534474
C  0.356927 1.118736 -0.994875
C  0.186532 -0.255936 1.025225
C  -3.550237 -1.493367 -1.14239
C  -3.916641 0.982262 -1.538331
C  -4.11255 0.091742 0.765145
C  2.438565 0.229381 0.038759
C  3.246542 -0.880014 0.433811
C  3.139387 1.446426 -0.226421
C  4.639017 -0.786444 0.597819
C  4.538854 1.547898 -0.091665
C  5.298403 0.43667 0.335546
H  -1.499683 1.360225 -2.061714
H  -0.837404 -0.311648 -2.112402
H  -0.980559 -1.72426 -0.046186
H  -1.796603 -1.045839 1.405087
H  0.984353 1.313727 -1.882551
H  0.188317 2.085939 -0.462339
H  0.014911 0.631717 1.6793
H  0.695874 -1.02886 1.619709
H  -3.221374 -2.281006 -0.443957
H  -3.014324 -1.620648 -2.100883
H  -4.628682 -1.643605 -1.312123
H  -3.580871 0.820418 -2.578065
H  -3.653044 2.009007 -1.227517
H  -5.015849 0.887213 -1.523774
H  2.566016 2.330306 -0.522312
H  -2.661613 1.417022 1.370509
H  -4.047572 1.244434 2.499523
H  5.204158 -1.673322 0.8999
H  5.032455 2.502477 -0.30469
H  6.384228 0.506833 0.45266
