program: Gaussian 09
title: 000258985
version: EM64L-G09RevD.01
frameworkgroup: C1[X(C15H21N3)]
method: RPBEPBE
basis: SDD
operation: Freq
keyword: #pfreq=noraman
keyword: PBEPBE/SDD
title: #p freq=noraman PBEPBE/SDD
converged: NO YES NO NO
title: Mulliken charges:
elementType: N N N C C C C C C C C C C C C C C C H H H H H H H H H H H H H H H H H H H H H
charge: -0.115739 -0.175751 -0.013813 -0.364877 -0.380842 0.314801 -0.392046 -0.406854 0.481081 -0.725679 -0.726850 -0.224550 -0.544720 -0.400966 0.469990 -0.219022 -0.436587 -0.818544 0.210301 0.218259 0.218145 0.212390 0.210140 0.212578 0.205207 0.220381 0.231520 0.228687 0.237001 0.232177 0.228628 0.237068 0.232758 0.219083 0.217698 0.230625 0.234018 0.223176 0.221129
chargesum: 0.00000
title: Mulliken charges with hydrogens summed into heavy atoms:
elementType: N N N C C C C C C C C C C C C C C C
charge: -0.115739 -0.175751 -0.013813 0.063683 0.049693 0.314801 0.030673 0.018734 0.481081 -0.028471 -0.028978 -0.224550 -0.311962 -0.181883 0.469990 -0.001324 -0.205962 -0.140221
polarizability: 2.53225922e+02 1.48546520e+00 1.69266397e+02 2.63902864e+00 -3.90755094e+00 1.28472791e+02
1716.lowfreq: -6.1663 -0.0006 -0.0006 -0.0003 4.2199 10.4310 26.4174 29.9213 36.7721
frequency: 26.3881 29.8846 36.7658 60.8289 87.3467 93.9745 140.9374 163.3638 176.3800 197.6428 205.0790 212.4083 240.5963 256.3757 266.6868 295.5884 327.1442 360.9762 398.3213 400.4702 421.0496 441.0525 455.0718 460.0469 471.0490 522.4311 564.3103 567.7650 598.0609 626.4457 678.7151 693.6464 699.8572 733.4877 778.7099 828.4261 845.3606 851.1597 872.9858 906.2083 940.3361 950.3372 961.1598 966.1196 973.1844 983.3201 1008.0074 1008.7821 1045.2446 1052.8286 1058.6554 1083.4224 1099.7303 1105.3517 1134.2884 1165.2675 1167.0742 1183.6339 1197.1352 1200.1610 1208.2659 1226.0163 1255.4398 1281.8230 1306.4336 1317.1623 1347.3374 1350.1399 1358.9389 1374.7229 1376.1594 1382.2465 1389.1047 1393.9779 1394.8403 1435.9268 1450.3291 1457.9801 1462.3426 1464.4459 1469.6721 1473.2808 1475.5412 1478.0397 1478.9652 1495.3788 1502.3921 1591.4849 1617.0922 2156.2208 2893.4757 2900.4462 2907.6017 2916.7195 2973.0006 3000.5969 3003.6822 3053.1640 3054.0271 3075.0883 3078.1522 3081.8606 3089.6417 3102.2692 3109.1301 3109.5347 3113.8123 3120.9264 3140.6371 3144.2028 3160.5231
redmass: 4.6494 3.1079 1.1251 2.8804 6.2123 3.8572 3.8902 2.9899 1.8752 2.8494 2.9651 1.8955 1.6206 2.1050 1.8629 2.6609 2.8015 2.2923 2.8153 2.7622 3.1582 2.8240 3.3018 3.4626 2.9400 4.8245 4.7741 3.6431 4.5160 4.0772 3.1235 1.9351 3.8453 2.8679 1.5513 3.8980 1.5869 1.4351 1.4679 2.6752 1.4482 2.2730 2.0049 1.4081 2.4305 4.1932 1.7170 1.4087 1.5538 1.8143 2.1544 2.2445 1.6907 1.9704 4.8036 2.3842 2.8501 1.2171 1.4397 2.4780 1.5311 2.4543 1.6413 1.3734 1.3449 1.3063 1.4573 1.3212 1.9868 1.3840 1.3379 1.8455 2.1248 1.1933 1.2309 2.4557 1.0636 1.0988 1.0669 1.0943 1.0894 1.0568 1.2905 1.0638 1.0648 2.1776 1.0598 5.8169 5.9816 12.6798 1.0709 1.0709 1.0694 1.0702 1.0382 1.0350 1.0355 1.0904 1.0954 1.0892 1.0906 1.0996 1.0884 1.1005 1.0997 1.1003 1.0996 1.0857 1.0921 1.0900 1.0971
irintensity: 1.6454 1.0687 0.1963 2.0085 1.1648 0.2280 3.0150 1.1030 0.2205 2.6625 4.1446 2.3563 1.1279 2.2083 0.7590 19.1607 2.0706 0.3934 0.1304 0.0481 2.0648 3.1833 2.0618 4.0612 0.0980 0.7320 0.4550 0.9982 12.8431 2.3804 0.5522 20.3304 9.5892 13.3838 48.2267 3.8350 2.7975 10.6127 2.9515 6.9624 1.3659 20.9418 0.5536 0.7280 46.2118 27.1195 33.7039 4.7076 16.7263 1.0668 1.3695 2.7871 3.7513 12.4794 10.1490 114.4171 49.7220 2.0166 35.5339 31.6721 10.1558 0.4537 95.5345 39.1478 16.4881 0.1651 0.8138 9.6347 34.9899 21.2750 14.7088 2.6878 13.2340 33.4692 11.3997 18.4637 6.3748 7.9754 2.9185 49.0276 19.0439 12.8910 16.2004 4.6217 3.5275 110.6385 19.5473 27.7878 209.2843 5.1551 52.6679 15.3588 35.1974 130.6319 40.2976 13.2263 13.3227 19.0911 26.9505 27.8334 34.1993 22.1611 15.1456 3.3316 39.1743 22.6123 21.1321 4.6132 42.4349 14.4321 18.1858
temp: 298.150 k
press: 1.00000 atm
elementType: 7 7 7 6 6 6 6 6 6 6 6 6 6 6 6 6 6 6 1 1 1 1 1 1 1 1 1 1 1 1 1 1 1 1 1 1 1 1 1
symmnumber: 1
zpe: 868950.8 jmol-1
zpe.correction: 0.330966 hartree
zpe.thermalcorrener: 0.349379 hartree
zpe.thermalcorrenthalpy: 0.350323 hartree
zpe.thermalcorrgfe: 0.283489 hartree
zpe.sumelectzpe: -747.058163 hartree
zpe.sumelectthermal: -747.039750 hartree
zpe.sumelectthermalent: -747.038805 hartree
zpe.sumelectthermalfe: -747.105639 hartree
dipole: -0.3152 1.3756 -3.5528
dipole: 3.8228
quadrupole: -110.0320 -99.2231 -122.1859
quadrupole: -1.9238 16.1464 3.4816
quadrupole: 0.4483 11.2572 -11.7055 -1.9238 16.1464 3.4816
hfenergy: -747.3891284 hartree
pointgroup: C01 [X(C15H21N3)]
dipole: -0.0877437 0.490767 1.4189767 debye
polarizability: 252.5326216|-8.8970422|149.2083862|-2.8631951|-20.6180524|149.2241023 unknown
InChI: InChI=1S/C15H21N3/c1-13-5-4-6-14(11-13)17-7-9-18(10-8-17)15(2,3)12-16/h4-6,11H,7-10H2,1-3H3
charge 0 multiplicity 1
39 atoms
N  -2.286315 0.330824 0.404064
N  0.573526 0.189093 -0.147921
N  -4.378188 -0.842164 -2.130449
C  -1.642526 1.249519 -0.578965
C  -1.561362 -0.971608 0.378704
C  -3.778811 0.221261 0.278715
C  -0.166004 1.46842 -0.209794
C  -0.077504 -0.78409 0.744635
C  1.98842 0.183909 -0.280353
C  -4.437357 1.624783 0.40189
C  -4.352318 -0.687628 1.402652
C  -4.158323 -0.369127 -1.05568
C  2.807607 -0.698293 0.485587
C  2.634395 1.042549 -1.221002
C  4.212846 -0.750873 0.316415
C  4.032159 1.002439 -1.378639
C  4.828988 0.112881 -0.6212
C  5.042595 -1.733316 1.128184
H  -2.145676 2.229315 -0.55323
H  -1.709124 0.843838 -1.616691
H  -1.628626 -1.450187 -0.627543
H  -2.00425 -1.656861 1.119117
H  0.288003 2.132417 -0.96123
H  -0.118507 1.98877 0.775053
H  -0.00163 -0.473011 1.813598
H  0.418448 -1.764342 0.636525
H  -4.218593 2.276178 -0.45912
H  -5.53306 1.517369 0.465743
H  -4.068035 2.106546 1.323908
H  -4.074046 -1.746426 1.279669
H  -5.453731 -0.632351 1.400592
H  -3.975224 -0.324791 2.374716
H  2.357911 -1.345673 1.245353
H  2.047839 1.717112 -1.852192
H  4.504718 1.667356 -2.111201
H  5.916358 0.09074 -0.756088
H  5.12321 -2.708299 0.608828
H  6.069641 -1.359649 1.28588
H  4.593249 -1.925729 2.118869
