program: Gaussian 09
title: 000258980
version: EM64L-G09RevD.01
frameworkgroup: C1[X(C14H20ClN3O)]
method: RPBEPBE
basis: SDD
operation: Freq
keyword: #p
keyword: freq=noraman
keyword: PBEPBE/SDD
title: #p freq=noraman PBEPBE/SDD
converged: YES YES NO NO
title: Mulliken charges:
elementType: Cl O N N N C C C C C C C C C C C C C C H H H H H H H H H H H H H H H H H H H H
charge: -0.081671 -0.251642 -0.186784 -0.172971 -0.607095 0.268369 -0.392703 -0.365403 -0.417928 -0.387678 -0.761462 -0.740970 0.142229 0.500232 -0.310203 -0.395521 -0.103869 -0.206305 -0.293908 0.238821 0.211054 0.194890 0.228540 0.226044 0.204144 0.212889 0.208667 0.226870 0.222388 0.256595 0.205497 0.236173 0.256687 0.261273 0.221888 0.344373 0.325475 0.226466 0.256547
chargesum: 0.00000
title: Mulliken charges with hydrogens summed into heavy atoms:
elementType: Cl O N N N C C C C C C C C C C C C C C
charge: -0.081671 -0.251642 -0.186784 -0.172971 0.062753 0.268369 0.057172 0.058028 0.012260 0.033878 -0.055609 -0.042614 0.142229 0.500232 -0.048930 -0.173632 -0.103869 0.020162 -0.037361
polarizability: 2.64164025e+02 -3.32951417e+00 1.82514455e+02 -3.31063384e+00 8.90890625e-02 1.18896696e+02
1716.lowfreq: -4.4649 0.0023 0.0025 0.0025 4.1732 5.9966 27.9909 29.8636 60.1764
frequency: 27.8698 29.7194 60.1675 80.8010 98.7687 106.4749 162.6073 169.6574 178.2607 189.0027 227.4783 238.9788 249.8409 270.2103 283.4437 300.9901 310.9129 334.3455 350.3121 374.9535 387.5989 416.8975 438.4914 459.6082 464.0597 477.7843 512.3661 563.7847 575.8910 581.9187 622.1942 662.8311 677.9263 692.0802 720.5129 740.5854 755.4562 762.0341 767.5760 835.6591 849.5493 861.6599 898.0859 928.9680 934.5454 958.0105 965.1637 969.2834 970.7361 998.7358 1050.1137 1054.6258 1064.3765 1073.5403 1081.9869 1095.9463 1103.4517 1138.6101 1165.9871 1178.2716 1183.1733 1190.8996 1202.6015 1219.9928 1241.7467 1279.1520 1297.7948 1308.9596 1323.4085 1345.7271 1350.6756 1355.6689 1370.6905 1376.5387 1382.3837 1386.8721 1392.8325 1434.7540 1454.7555 1457.1039 1457.9511 1462.7300 1466.9697 1474.5417 1485.0103 1486.1727 1489.5091 1534.1131 1559.9837 1615.7762 1640.5076 2895.0248 2897.7167 2917.2042 2921.0381 2986.4030 2994.6154 3051.6820 3056.5710 3073.3419 3085.3103 3090.0315 3090.6526 3095.1694 3108.7079 3136.7650 3165.2878 3182.8500 3185.7303 3451.9020 3645.7592
redmass: 4.9193 4.7894 6.9451 4.4580 3.8799 4.3154 3.7541 4.0965 5.2474 1.3263 2.5442 2.4623 2.8405 2.1854 1.9404 1.8503 2.3650 2.4139 2.5545 8.7785 3.6844 3.0176 3.0211 2.9096 3.7676 2.9751 2.9656 4.5439 2.5992 1.5436 3.1549 5.5213 2.0278 2.7199 2.2587 1.5333 3.6735 1.8290 1.9904 1.6247 1.5337 1.4306 2.7366 1.5317 3.2412 1.4070 1.9668 3.1974 3.4842 1.3382 1.9643 2.1208 1.9704 2.0242 2.3353 1.7139 2.0614 4.4554 3.3487 2.5122 1.1417 2.4953 1.3105 2.3828 1.4662 1.3830 1.2910 1.3682 2.8171 1.4908 1.5509 1.6890 1.3236 1.5774 1.9940 1.5544 1.2296 3.2385 1.0662 1.0913 1.0784 1.1024 1.0927 1.0825 1.5100 1.4645 1.0635 1.2870 6.3469 6.7528 7.0241 1.0705 1.0700 1.0704 1.0684 1.0352 1.0368 1.0927 1.0894 1.0909 1.0998 1.0962 1.0916 1.0995 1.0983 1.0871 1.0928 1.0937 1.0940 1.0475 1.1008
irintensity: 0.6491 0.4872 5.3517 2.8319 1.7474 2.0692 0.4232 1.0694 1.4864 1.0493 1.1686 4.7071 4.2241 6.5993 2.5231 8.9709 4.3780 1.8156 5.3339 7.3087 2.0923 7.6409 5.7191 1.1111 2.5755 1.3104 4.5355 1.8613 41.7715 151.2194 6.4796 7.5019 28.4068 4.7063 76.4434 19.3470 13.9982 66.5249 12.2703 26.2453 8.3867 0.2251 2.4211 2.2596 89.3558 0.4424 12.0824 11.0264 79.3890 5.7000 1.8606 4.2326 9.1349 10.3501 7.6621 12.0639 1.7232 22.3539 27.1109 73.3829 2.3455 104.4777 4.0452 3.1565 111.8883 42.8762 3.8227 15.9388 33.4053 1.3704 6.9012 10.6853 33.0387 30.2696 19.6239 25.3646 28.4435 4.1690 3.2440 4.9273 4.1202 61.2595 37.6079 2.2384 119.9529 31.5906 8.6507 155.4114 91.3035 287.1846 262.8351 79.5870 8.7560 16.7203 155.7361 17.7996 20.9875 22.4933 22.4088 30.0100 8.7247 7.0780 47.2792 18.2900 22.4200 13.0405 17.8322 6.2186 1.1733 67.7477 76.6511
temp: 298.150 k
press: 1.00000 atm
elementType: 17 8 7 7 7 6 6 6 6 6 6 6 6 6 6 6 6 6 6 1 1 1 1 1 1 1 1 1 1 1 1 1 1 1 1 1 1 1 1
symmnumber: 1
zpe: 847927.8 jmol-1
zpe.correction: 0.322959 hartree
zpe.thermalcorrener: 0.341742 hartree
zpe.thermalcorrenthalpy: 0.342686 hartree
zpe.thermalcorrgfe: 0.275672 hartree
zpe.sumelectzpe: -1243.584781 hartree
zpe.sumelectthermal: -1243.565998 hartree
zpe.sumelectthermalent: -1243.565053 hartree
zpe.sumelectthermalfe: -1243.632068 hartree
dipole: -0.2038 3.2103 -1.7354
dipole: 3.6550
quadrupole: -156.3845 -114.6676 -120.8176
quadrupole: -2.7653 6.0028 3.2261
quadrupole: -25.7613 15.9556 9.8056 -2.7653 6.0028 3.2261
hfenergy: -1243.9077393 hartree
pointgroup: C01 [X(C14H20Cl1N3O1)]
dipole: 0.0517676 -1.1418737 0.8724875 debye
polarizability: 262.9225774|10.7140289|182.2703336|-1.4852651|-9.951173|120.3822654 unknown
InChI: InChI=1S/C14H20ClN3O/c1-14(2,13(16)19)18-8-6-17(7-9-18)12-5-3-4-11(15)10-12/h3-5,10H,6-9,16H2,1-2H3
charge 0 multiplicity 1
39 atoms
Cl 5.252891 2.512332 -0.56916
O  -5.264314 1.287755 -0.334769
N  -2.021145 -0.301437 0.215899
N  0.876735 -0.334065 0.006582
N  -3.541065 1.694275 1.184278
C  -3.502205 -0.444457 -0.051417
C  -1.308333 0.523513 -0.798377
C  -1.261988 -1.562176 0.41588
C  0.108534 0.883177 -0.316593
C  0.154408 -1.242919 0.926139
C  -4.144898 -1.422214 0.972819
C  -3.84931 -0.905584 -1.490877
C  -4.183006 0.941104 0.225562
C  2.290221 -0.2942 0.013157
C  2.995368 0.927746 -0.217967
C  3.064634 -1.480349 0.213376
C  4.399035 0.919603 -0.266402
C  4.470248 -1.441518 0.16972
C  5.173537 -0.237324 -0.078063
H  -1.872713 1.456941 -0.971494
H  -1.220527 -0.012552 -1.771307
H  -1.182546 -2.152956 -0.528313
H  -1.765341 -2.184354 1.17332
H  0.614656 1.42578 -1.133422
H  0.041617 1.565296 0.56394
H  0.070032 -0.775244 1.934338
H  0.710469 -2.185918 1.039248
H  -3.815862 -1.194377 2.002348
H  -3.901141 -2.473547 0.738189
H  -5.242245 -1.316514 0.92831
H  -3.407172 -1.897733 -1.697227
H  -3.492259 -0.191078 -2.251537
H  -4.943682 -0.970986 -1.601686
H  2.468655 1.87685 -0.332557
H  2.571571 -2.443557 0.371399
H  -2.650408 1.335884 1.542308
H  -3.940208 2.581371 1.486537
H  5.035558 -2.368636 0.315633
H  6.264602 -0.206329 -0.122812
