program: Gaussian 09
title: 000258962
version: EM64L-G09RevD.01
frameworkgroup: C1[X(C13H16ClN3)]
method: RPBEPBE
basis: SDD
operation: Freq
keyword: #p
keyword: freq=noraman
keyword: PBEPBE/SDD
title: #p freq=noraman PBEPBE/SDD
converged: YES YES NO NO
title: Mulliken charges:
elementType: Cl N N N C C C C C C C C C C C C C H H H H H H H H H H H H H H H H
charge: -0.067025 -0.104603 -0.166140 -0.008994 -0.357118 -0.373027 -0.414900 -0.425327 0.002763 0.534954 -0.728667 -0.298178 -0.339204 -0.196488 -0.221381 -0.241777 -0.245559 0.202613 0.218955 0.239059 0.196822 0.217141 0.235078 0.232189 0.208651 0.222373 0.239107 0.230286 0.243551 0.249748 0.252506 0.228088 0.234503
chargesum: 0.00000
title: Mulliken charges with hydrogens summed into heavy atoms:
elementType: Cl N N N C C C C C C C C C C C C C
charge: -0.067025 -0.104603 -0.166140 -0.008994 0.064450 0.062854 0.037319 0.015513 0.225136 0.534954 -0.015723 -0.298178 -0.089456 -0.196488 0.031125 -0.013688 -0.011056
polarizability: 2.31526058e+02 5.70724036e+00 1.71449974e+02 -1.73662008e+00 -4.32904645e+00 9.96338018e+01
1716.lowfreq: -8.3450 -1.9451 -0.0015 0.0011 0.0017 5.7679 32.2013 37.8797 63.0933
frequency: 32.1231 37.8568 63.0822 89.7555 111.4324 123.9180 165.0744 195.7409 217.6770 226.2179 246.4036 268.9178 273.0307 305.8924 323.9553 362.5087 396.6674 409.5710 446.6273 457.8841 472.1342 489.8399 547.2204 553.6006 578.9759 618.9648 657.3370 712.2696 734.0565 744.6139 754.1717 830.0131 843.4987 852.6263 919.9077 929.9493 949.9734 965.1858 972.3431 1006.9977 1024.6015 1043.2920 1052.4925 1063.3867 1079.2128 1088.1975 1106.7753 1122.4105 1132.9792 1150.6197 1171.9134 1189.3392 1209.0608 1234.8915 1260.0310 1282.2178 1283.5879 1296.9180 1311.7714 1344.7003 1348.3845 1360.2469 1368.1609 1380.3660 1386.9321 1391.2471 1428.1046 1453.6159 1456.3245 1459.7680 1466.7439 1475.2242 1480.5389 1482.7891 1560.4796 1606.5132 2193.9983 2823.8252 2872.6030 2880.8639 2908.8587 2923.5343 3004.7197 3046.7999 3058.7013 3067.6195 3098.4558 3105.4718 3113.9106 3134.3402 3151.6014 3161.5196 3175.5363
redmass: 6.3897 4.6696 4.8628 4.6615 3.7996 4.9385 5.1371 1.6598 6.1616 4.8415 2.3717 1.8857 3.4442 2.8566 3.3283 4.2833 2.4633 3.6888 3.3851 4.1576 3.4657 4.2592 3.8423 3.9822 5.7047 2.9545 4.5140 3.8015 4.3825 2.6506 1.3430 2.7681 1.4213 1.5171 3.4853 1.3916 2.4590 2.0632 1.3503 5.3591 2.3389 2.2101 1.7451 1.9770 2.0731 2.1535 2.3748 1.8284 2.9377 2.8721 1.1088 1.9780 1.3469 1.4464 1.3781 1.3971 1.2351 1.3658 1.4484 1.3890 1.5710 1.6540 2.8611 1.6433 1.3694 1.2179 2.4322 1.0790 1.0937 1.1471 1.1100 1.0642 2.0624 1.1509 5.8884 6.8400 12.5720 1.0789 1.0709 1.0695 1.0688 1.0711 1.0351 1.0902 1.0912 1.0895 1.0902 1.0996 1.1017 1.0856 1.0893 1.0943 1.1003
irintensity: 1.3099 3.7741 2.1545 1.6901 2.9959 1.8633 1.0571 0.2818 1.6584 3.3188 3.0532 2.2358 0.4343 4.1083 5.1983 0.5596 1.4688 3.2614 7.2610 3.1949 2.2783 2.9305 1.4060 5.1571 0.9778 1.4104 20.1869 2.1709 7.6152 1.6101 97.3333 0.2758 0.4638 1.5957 18.6588 2.8441 36.0247 15.2540 1.0368 43.3432 47.6908 9.1411 3.0143 2.5871 3.9393 6.4884 9.4282 8.7893 64.7249 39.6221 1.5203 5.7175 6.8559 103.2316 18.2068 22.2568 7.3389 16.7863 29.7132 1.8034 5.6178 8.8938 19.8828 41.0915 2.0421 17.1102 11.6822 1.6235 8.0010 86.0343 9.2830 4.6465 119.7110 5.7220 2.2880 75.1218 3.0036 63.4315 44.2509 68.5249 65.0881 99.3562 12.7936 21.9709 25.0334 32.1325 5.4995 25.2223 15.7403 5.3696 9.0892 15.6171 13.6477
temp: 298.150 k
press: 1.00000 atm
elementType: 17 7 7 7 6 6 6 6 6 6 6 6 6 6 6 6 6 1 1 1 1 1 1 1 1 1 1 1 1 1 1 1 1
symmnumber: 1
zpe: 700797.6 jmol-1
zpe.correction: 0.266920 hartree
zpe.thermalcorrener: 0.283058 hartree
zpe.thermalcorrenthalpy: 0.284003 hartree
zpe.thermalcorrgfe: 0.222534 hartree
zpe.sumelectzpe: -1127.988571 hartree
zpe.sumelectthermal: -1127.972432 hartree
zpe.sumelectthermalent: -1127.971488 hartree
zpe.sumelectthermalfe: -1128.032957 hartree
dipole: -1.8160 1.5440 0.7699
dipole: 2.5049
quadrupole: -119.1808 -106.9819 -110.3820
quadrupole: 21.8305 0.2754 0.3606
quadrupole: -6.9993 5.1996 1.7996 21.8305 0.2754 0.3606
hfenergy: -1128.2554908 hartree
pointgroup: C01 [X(C13H16Cl1N3)]
dipole: 0.6982508 -0.6189851 0.3170693 debye
polarizability: 231.8834743|3.2938008|171.3301839|-2.192945|0.1847133|99.3961757 unknown
InChI: InChI=1S/C13H16ClN3/c1-11(10-15)16-6-8-17(9-7-16)13-5-3-2-4-12(13)14/h2-5,11H,6-9H2,1H3
charge 0 multiplicity 1
33 atoms
Cl 2.259376 -2.592522 -0.471543
N  -2.280067 -0.119197 0.354929
N  0.601326 0.030718 0.080004
N  -5.161243 1.71116 -0.380464
C  -1.421396 -1.307323 0.619425
C  -1.634953 0.753021 -0.666502
C  -0.03126 -0.854774 1.090585
C  -0.243847 1.210294 -0.196407
C  -3.674515 -0.48994 -0.034974
C  2.010202 0.185916 0.07876
C  -4.378778 -1.38853 1.015223
C  2.90507 -0.909175 -0.119263
C  2.620772 1.469652 0.22634
C  -4.481697 0.743033 -0.226694
C  4.301945 -0.758256 -0.129557
C  4.019425 1.640186 0.191375
C  4.87198 0.526236 0.027671
H  -1.306995 -1.944896 -0.292436
H  -1.87484 -1.915412 1.41951
H  -2.267698 1.644349 -0.825405
H  -1.526156 0.219849 -1.643818
H  -0.141512 -0.306816 2.05437
H  0.600588 -1.738502 1.262252
H  0.221168 1.811633 -0.996958
H  -0.364398 1.854677 0.705768
H  -3.686909 -1.027936 -1.020896
H  -5.451293 -1.479717 0.774525
H  -3.948577 -2.403327 1.021095
H  -4.277852 -0.944472 2.019646
H  1.980108 2.340965 0.393196
H  4.935471 -1.635942 -0.28894
H  4.442086 2.643866 0.310116
H  5.959572 0.646179 0.008764
