program: Gaussian 09
title: 000258970
version: EM64L-G09RevD.01
frameworkgroup: C1[X(C13H19N3O)]
method: RPBEPBE
basis: SDD
operation: Freq
keyword: #p
keyword: freq=noraman
keyword: PBEPBE/SDD
title: #p freq=noraman PBEPBE/SDD
converged: YES YES NO NO
title: Mulliken charges:
elementType: O N N N C C C C C C C C C C C C C H H H H H H H H H H H H H H H H H H H
charge: -0.233319 -0.083246 -0.176178 -0.612544 -0.345781 -0.369562 -0.395557 -0.414245 -0.063819 0.469106 -0.740636 0.162022 -0.381171 -0.377303 -0.226019 -0.234804 -0.268904 0.180983 0.210693 0.240018 0.179221 0.220755 0.204441 0.213513 0.221259 0.164134 0.216833 0.260763 0.223310 0.215121 0.232669 0.217875 0.217939 0.312909 0.334732 0.224794
chargesum: 0.00000
title: Mulliken charges with hydrogens summed into heavy atoms:
elementType: O N N N C C C C C C C C C C C C C
charge: -0.233319 -0.083246 -0.176178 0.035097 0.045895 0.049677 0.029639 0.020526 0.100314 0.469106 -0.039730 0.162022 -0.166050 -0.144634 -0.008145 -0.016865 -0.044111
polarizability: 2.34028669e+02 -1.32577198e+00 1.54408113e+02 -1.04531001e+00 6.19658237e+00 1.10543766e+02
1716.lowfreq: -10.9811 -1.7375 -0.0011 -0.0010 -0.0006 7.8904 24.3757 35.1894 38.6136
frequency: 24.0432 34.9005 38.3467 62.6230 86.7531 116.3705 144.0794 189.6656 213.6239 238.4744 255.9322 264.8646 289.1459 316.7517 347.6188 391.5338 408.3514 429.4948 444.6106 471.5856 515.3560 516.5411 530.9615 602.5575 607.4446 614.1795 625.9829 690.8043 715.7071 722.5378 756.2067 766.3880 797.7710 815.3395 846.8646 873.9382 915.0346 952.6152 955.8300 965.9680 975.7390 978.2333 1011.4402 1031.1209 1042.5885 1053.3819 1061.5891 1082.3394 1084.9467 1088.8631 1111.2711 1145.0896 1161.3012 1170.8281 1194.2441 1199.7456 1216.3635 1236.7261 1257.2894 1281.7256 1291.7143 1308.0458 1325.8914 1345.0966 1348.0726 1361.4070 1362.5239 1377.4740 1384.0606 1386.0031 1395.8286 1446.1581 1454.1146 1458.0304 1461.7875 1468.5802 1475.1351 1481.4150 1496.1030 1578.7138 1590.7548 1618.3898 1649.7307 2782.8000 2839.8595 2851.5571 2918.0792 2924.3526 2997.1561 3052.2092 3056.3533 3064.1102 3089.2191 3091.1396 3111.3356 3120.5356 3126.9989 3148.8990 3156.3740 3168.0597 3511.2536 3667.8984
redmass: 4.7192 4.0047 4.1547 3.1570 5.0156 3.6475 4.8829 1.3712 2.7488 2.9797 2.1517 3.2780 2.3714 3.3484 3.2976 2.1472 2.8729 3.4615 3.5552 2.8178 1.7818 1.5433 3.0094 1.4606 3.5401 6.2148 2.0486 1.8073 3.7149 3.3749 1.8914 3.4215 2.5358 1.3078 1.5537 1.4941 3.5082 2.3428 1.3845 2.0595 1.3363 4.9165 1.8456 2.1412 1.8979 1.7587 2.2463 1.8935 2.4744 1.6517 2.4030 3.0791 3.1227 1.0651 1.7985 1.1401 1.5703 1.4394 1.7988 1.4059 1.2572 1.4426 1.3938 1.4295 1.4131 1.7056 1.7742 1.7138 1.8421 1.7786 1.5015 2.4194 1.0857 1.1119 1.0974 1.1025 1.0845 1.0478 2.3952 5.9419 1.3372 6.0421 4.3349 1.0800 1.0715 1.0700 1.0690 1.0709 1.0353 1.0897 1.0897 1.0882 1.0982 1.0892 1.1011 1.0843 1.0883 1.0918 1.0939 1.1001 1.0446 1.1041
irintensity: 4.7051 3.2935 5.5464 3.4085 1.7894 2.2444 0.9573 1.9026 2.5129 4.5007 0.4391 5.5085 2.7974 13.9553 0.3603 0.9455 0.7430 1.6604 0.5617 1.0280 93.3639 77.6775 14.4287 95.1266 9.9772 0.6293 7.0578 41.7273 14.6518 17.4024 74.0995 17.6188 4.8086 1.3970 0.1233 4.9243 20.9215 33.5799 0.0634 9.2544 0.5448 12.5547 30.4804 18.2890 11.3491 0.2117 3.3871 3.3491 0.8719 6.4931 8.0487 81.8978 43.8950 0.2278 4.4703 1.7348 1.8691 198.7561 55.6074 62.2610 9.0364 40.7414 0.3719 5.8224 5.8966 15.6667 16.9401 30.8175 19.6218 33.6509 8.4133 1.5856 1.5604 9.4854 23.3822 42.5886 3.7220 20.3880 131.8067 10.4847 85.7823 164.2367 241.5699 110.7038 48.3104 137.9489 40.7640 102.4836 20.2383 22.2142 31.7976 33.0707 28.7507 25.7900 14.0326 9.6670 9.1706 39.7739 40.7739 7.3183 27.9202 24.2902
temp: 298.150 k
press: 1.00000 atm
elementType: 8 7 7 7 6 6 6 6 6 6 6 6 6 6 6 6 6 1 1 1 1 1 1 1 1 1 1 1 1 1 1 1 1 1 1 1
symmnumber: 1
zpe: 799612.9 jmol-1
zpe.correction: 0.304556 hartree
zpe.thermalcorrener: 0.320964 hartree
zpe.thermalcorrenthalpy: 0.321908 hartree
zpe.thermalcorrgfe: 0.259179 hartree
zpe.sumelectzpe: -744.960010 hartree
zpe.sumelectthermal: -744.943602 hartree
zpe.sumelectthermalent: -744.942658 hartree
zpe.sumelectthermalfe: -745.005388 hartree
dipole: -2.1229 1.0179 3.8926
dipole: 4.5492
quadrupole: -98.8778 -92.8010 -106.9767
quadrupole: -0.6421 -18.5663 -3.5495
quadrupole: 0.6740 6.7509 -7.4249 -0.6421 -18.5663 -3.5495
hfenergy: -745.2645666 hartree
pointgroup: C01 [X(C13H19N3O1)]
dipole: -0.8239702 -0.4327932 -1.5287678 debye
polarizability: 234.0081346|1.2427503|154.6532078|1.9622146|5.2519111|110.319205 unknown
InChI: InChI=1S/C13H19N3O/c1-11(13(14)17)15-7-9-16(10-8-15)12-5-3-2-4-6-12/h2-6,11H,7-10,14H2,1H3
charge 0 multiplicity 1
36 atoms
O  -4.219967 1.179278 1.135206
N  -1.86398 -0.407601 0.129792
N  1.026544 -0.141492 -0.042907
N  -4.746818 1.22016 -1.122997
C  -1.002267 -1.589272 -0.119086
C  -1.233095 0.797373 -0.463167
C  0.392425 -1.369358 0.488323
C  0.166748 1.045055 0.125794
C  -3.267674 -0.593418 -0.319112
C  2.437309 0.001259 -0.006227
C  -3.967542 -1.76965 0.401913
C  -4.095886 0.684896 -0.019845
C  3.292556 -1.111599 -0.278515
C  3.058152 1.260671 0.258338
C  4.692964 -0.965302 -0.289289
C  4.462785 1.396411 0.233689
C  5.297235 0.289708 -0.03732
H  -0.896882 -1.795384 -1.216368
H  -1.447188 -2.477834 0.359219
H  -1.860025 1.678074 -0.240047
H  -1.143128 0.701598 -1.576819
H  0.285995 -1.296507 1.594853
H  1.019697 -2.246232 0.266529
H  0.614506 1.89785 -0.412863
H  0.063313 1.324032 1.199632
H  -3.304901 -0.779125 -1.429202
H  -3.530482 -2.744352 0.126669
H  -3.886308 -1.625309 1.492108
H  -5.038408 -1.797886 0.132074
H  2.863941 -2.091163 -0.513525
H  2.451813 2.135758 0.509179
H  5.317713 -1.839203 -0.509114
H  4.905462 2.377364 0.443889
H  -4.62618 0.837927 -2.059409
H  -5.357614 2.025968 -0.986924
H  6.386591 0.398808 -0.050074
