program: Gaussian 09
title: 000258959
version: EM64L-G09RevD.01
frameworkgroup: C1[X(C12H16ClN3O)]
method: RPBEPBE
basis: SDD
operation: Freq
keyword: #p
keyword: freq=noraman
keyword: PBEPBE/SDD
title: #p freq=noraman PBEPBE/SDD
converged: YES YES NO NO
title: Mulliken charges:
elementType: Cl O N N N C C C C C C C C C C C C H H H H H H H H H H H H H H H H
charge: -0.062176 -0.260549 -0.141364 -0.167343 -0.598925 -0.378813 -0.361046 -0.412823 -0.402751 -0.417804 0.536677 -0.299880 -0.340020 0.167606 -0.220430 -0.240549 -0.245075 0.228832 0.211178 0.209900 0.212349 0.235661 0.193218 0.210035 0.236645 0.230087 0.240672 0.246865 0.252967 0.227882 0.234857 0.327036 0.347078
chargesum: 0.00000
title: Mulliken charges with hydrogens summed into heavy atoms:
elementType: Cl O N N N C C C C C C C C C C C C
charge: -0.062176 -0.260549 -0.141364 -0.167343 0.075189 0.061198 0.061203 0.016056 0.043930 0.052955 0.536677 -0.299880 -0.093155 0.167606 0.032537 -0.012667 -0.010218
polarizability: 2.25868542e+02 1.16957460e+01 1.64784271e+02 -3.83743343e+00 -4.69973446e+00 9.85113121e+01
1716.lowfreq: -0.0022 -0.0017 0.0011 7.4026 9.7228 16.8007 31.2941 46.6074 57.2205
frequency: 30.8503 46.3793 57.1979 83.8283 88.2125 122.3079 167.5995 195.1918 222.5314 243.3600 268.5436 300.4330 329.8684 341.5482 360.0962 409.3601 418.6237 447.9037 475.8022 486.2760 502.8377 521.6832 549.0523 571.9415 625.0313 634.3803 659.0782 713.0910 731.7429 735.4102 753.8281 787.8816 843.0973 850.0392 855.5004 921.7303 929.3882 936.8436 972.3005 993.4675 1006.7439 1013.2524 1041.8705 1055.0611 1062.2821 1066.4093 1098.7206 1121.8540 1136.4356 1136.9487 1166.7861 1174.9696 1204.9425 1227.1680 1236.9238 1269.4476 1279.8962 1298.4509 1318.2699 1336.0142 1342.7864 1355.2276 1359.8935 1370.4476 1378.2290 1383.3719 1428.2468 1449.7453 1457.5020 1460.1628 1463.1891 1471.2132 1480.8679 1533.4139 1561.4647 1605.7010 1653.4534 2885.4427 2902.3066 2904.4479 2917.7613 2941.2985 3035.5228 3040.2531 3043.2704 3058.4779 3101.7566 3133.4263 3150.2089 3159.5523 3174.5446 3445.7473 3646.8432
redmass: 6.3579 4.4941 6.5299 4.7234 5.6383 3.6574 4.5997 3.8558 5.7325 5.2904 2.9513 2.3304 2.4091 2.9097 5.8883 2.1324 5.6396 3.3672 2.9590 3.6505 2.1241 2.7123 3.5773 3.7707 2.5026 1.9737 3.9105 3.7531 3.3637 1.1250 1.3153 3.5457 1.4360 1.8415 2.6028 2.8558 1.6574 2.0865 1.3177 2.0610 2.8834 4.2607 2.3204 1.7518 1.9446 1.9624 2.2548 1.7821 2.7272 2.9251 1.7283 1.2292 1.0925 1.4444 1.4777 1.5260 1.3713 1.3830 1.5026 2.7183 1.3818 1.8294 1.6818 2.3470 1.6565 1.4199 2.4204 1.0901 1.0889 1.1206 1.1304 1.1068 2.5092 1.2949 5.9675 6.8268 7.3975 1.0700 1.0694 1.0696 1.0693 1.0663 1.0931 1.0914 1.0936 1.0903 1.0894 1.0856 1.0892 1.0945 1.1004 1.0483 1.1001
irintensity: 1.2537 1.4521 4.9965 4.0811 2.7198 1.6171 0.5977 7.0932 0.2017 7.6389 7.1261 1.1787 7.8693 5.3077 6.3297 5.2107 7.9923 7.5235 2.7300 8.7880 29.4029 12.9955 0.4000 31.2762 38.6455 135.9847 22.0414 2.6268 14.7248 37.5391 86.9985 11.1141 0.2235 0.6992 4.3497 26.4142 8.0931 10.0500 0.3781 11.5264 53.9807 57.7059 12.2863 3.2048 12.9519 8.1293 5.7516 10.9351 44.3490 19.8598 10.3409 3.1555 3.5584 42.9124 62.5656 12.1096 32.4341 30.9247 13.6831 63.7951 3.1372 0.6453 5.6139 16.4871 41.7881 10.5098 12.7987 3.9813 7.3681 44.6206 49.4924 1.3774 107.6613 165.4254 2.1038 74.4782 337.5961 52.3342 65.0574 23.3502 122.4317 63.1930 4.5954 37.4243 43.4195 21.5670 5.8449 5.4685 8.4182 16.4688 14.1164 81.7843 83.6553
temp: 298.150 k
press: 1.00000 atm
elementType: 17 8 7 7 7 6 6 6 6 6 6 6 6 6 6 6 6 1 1 1 1 1 1 1 1 1 1 1 1 1 1 1 1
symmnumber: 1
zpe: 704196.5 jmol-1
zpe.correction: 0.268214 hartree
zpe.thermalcorrener: 0.283969 hartree
zpe.thermalcorrenthalpy: 0.284913 hartree
zpe.thermalcorrgfe: 0.224047 hartree
zpe.sumelectzpe: -1165.132252 hartree
zpe.sumelectthermal: -1165.116497 hartree
zpe.sumelectthermalent: -1165.115553 hartree
zpe.sumelectthermalfe: -1165.176419 hartree
dipole: -3.3460 -2.3451 2.1229
dipole: 4.6046
quadrupole: -136.2579 -99.0239 -109.1677
quadrupole: 0.3510 9.3972 -0.0223
quadrupole: -21.4414 15.7926 5.6488 0.3510 9.3972 -0.0223
hfenergy: -1165.4004661 hartree
pointgroup: C01 [X(C12H16Cl1N3O1)]
dipole: 1.2498443 0.9981952 0.850484 debye
polarizability: 224.5623955|12.3181714|165.2087274|12.5984044|-0.1792821|99.3930018 unknown
InChI: InChI=1S/C12H16ClN3O/c13-10-3-1-2-4-11(10)16-7-5-15(6-8-16)9-12(14)17/h1-4H,5-9,14H2
charge 0 multiplicity 1
33 atoms
Cl 2.490936 -2.572428 0.182556
O  -5.843071 -0.316621 -1.033774
N  -2.316366 -0.580557 0.010558
N  0.534023 -0.115884 0.03043
N  -4.510084 0.964516 0.40295
C  -1.64352 0.151112 -1.097183
C  -1.386224 -1.57189 0.617747
C  -0.378405 0.866346 -0.589963
C  -0.127941 -0.85821 1.134657
C  -3.61458 -1.158001 -0.410332
C  1.910612 0.206627 0.138254
C  2.925456 -0.790992 0.254732
C  2.367853 1.559211 0.086252
C  -4.766869 -0.128293 -0.39539
C  4.291748 -0.477248 0.354898
C  3.736812 1.887511 0.159101
C  4.708405 0.87325 0.30857
H  -2.347314 0.898128 -1.507759
H  -1.358144 -0.547488 -1.919804
H  -1.079568 -2.352649 -0.117722
H  -1.900668 -2.067295 1.461525
H  0.129895 1.34529 -1.444779
H  -0.680752 1.664129 0.130665
H  -0.420716 -0.146685 1.941672
H  0.56859 -1.595975 1.559301
H  -3.592075 -1.611929 -1.425965
H  -3.895603 -1.963196 0.294592
H  1.628499 2.362491 0.008933
H  5.023759 -1.286413 0.438252
H  4.041524 2.939007 0.116151
H  5.773006 1.117902 0.375319
H  -5.21274 1.693217 0.516573
H  -3.593779 0.999416 0.861681
