program: Gaussian 09
title: 000258924
version: EM64L-G09RevD.01
frameworkgroup: C1[X(C14H15N2PS)]
method: RPBEPBE
basis: SDD
operation: Freq
keyword: #p
keyword: freq=noraman
keyword: PBEPBE/SDD
title: #p freq=noraman PBEPBE/SDD
converged: YES YES NO NO
title: Mulliken charges:
elementType: S P N N C C C C C C C C C C C C C C H H H H H H H H H H H H H H H
charge: -0.212676 0.576039 -0.801961 -0.800199 0.375201 0.374785 0.094197 -0.592794 -0.592450 0.386047 0.386057 -0.285726 -0.330263 -0.822760 -0.822704 -0.223472 -0.214041 -0.223411 0.325627 0.325546 0.232887 0.232904 0.272151 0.283517 0.222809 0.224607 0.228670 0.222599 0.228677 0.224847 0.235573 0.235392 0.234328
chargesum: 0.00000
title: Mulliken charges with hydrogens summed into heavy atoms:
elementType: S P N N C C C C C C C C C C C C C C
charge: -0.212676 0.576039 -0.476335 -0.474653 0.375201 0.374785 0.094197 -0.359907 -0.359547 0.386047 0.386057 -0.013575 -0.046746 -0.146675 -0.146582 0.012101 0.021351 0.010917
polarizability: 3.06913723e+02 2.23106618e+01 1.94224989e+02 1.06485118e-01 2.28816286e-01 1.40108688e+02
1716.lowfreq: -7.7923 -4.7055 0.0008 0.0021 0.0021 7.7362 29.2079 33.4327 54.3659
frequency: 28.3916 33.3676 54.3592 102.3207 115.0016 115.7894 144.2888 146.7227 172.8394 192.5930 237.0004 246.4699 274.2875 292.9255 296.4236 316.8400 365.3706 394.8203 414.8505 425.3080 427.1629 434.8456 461.4094 486.7809 536.4121 551.4447 608.5520 633.0400 652.6742 690.8895 697.8702 726.6211 733.4505 750.0999 761.9375 780.6586 785.3643 858.9871 859.9619 860.8908 866.9748 940.6855 986.1834 988.3979 998.5563 1001.8953 1007.2898 1018.8025 1025.1920 1050.4310 1077.6064 1081.6746 1099.5354 1174.3968 1187.1477 1193.3542 1204.4395 1230.3305 1276.7482 1293.2551 1309.3659 1328.6092 1383.2897 1392.0514 1404.0016 1416.9817 1428.4115 1436.5391 1461.8727 1462.9306 1475.7457 1482.0896 1483.5273 1503.9358 1587.9759 1592.6882 1599.5491 1630.7952 2964.1502 2965.5757 3033.4393 3037.7301 3077.0947 3079.7746 3126.3106 3129.2996 3132.1657 3132.4101 3143.0286 3154.8689 3167.7618 3604.1949 3605.3318
redmass: 3.7358 5.3526 3.9112 6.4007 3.0587 1.2874 2.9017 2.0190 1.6966 4.4053 4.3665 5.3997 3.1374 2.6150 4.4125 8.2933 2.9752 2.6238 2.7280 2.0116 1.8570 2.1967 4.8291 3.2743 3.7616 10.2186 6.4913 4.3467 8.5695 7.2403 2.0375 6.1187 5.0380 2.9431 1.6725 5.8977 4.3553 1.4918 1.2527 2.4332 1.5407 1.3747 6.2086 1.3816 1.3864 1.5456 1.3262 3.1070 1.4182 1.6127 2.0345 1.9419 4.3669 1.0560 1.1368 1.4246 5.1214 1.2880 1.5055 1.3992 1.3147 8.3113 9.3996 1.2358 1.2102 4.0593 2.1319 2.1711 1.0469 2.0403 1.0459 1.1015 1.4524 3.9052 6.0564 5.9429 7.0631 7.2763 1.0373 1.0382 1.0972 1.0970 1.0982 1.0974 1.0870 1.0915 1.0918 1.0876 1.0914 1.0962 1.1015 1.0778 1.0792
irintensity: 0.0166 0.4281 0.4891 0.6984 0.9606 0.2737 0.7979 6.7684 3.8262 0.0586 2.3936 0.5189 0.4029 0.2715 4.6230 2.9206 16.9786 0.6086 5.1309 53.2009 11.4121 76.3644 120.8715 21.2149 1.7598 87.2520 3.8337 0.0033 106.6383 26.5806 42.6074 1.6555 35.1322 1.3191 65.4194 82.0106 0.2445 61.1845 0.4304 84.3600 0.0028 1.4816 0.7479 0.4898 50.5134 0.1314 0.0770 1.6530 15.4778 0.0105 42.0814 19.2750 0.9235 0.0284 17.5045 14.5168 4.6900 2.6085 147.4073 0.0061 6.1694 302.1159 0.5499 5.0174 31.9952 27.9772 26.1511 1.4479 0.0003 12.4282 28.5000 0.3562 29.2074 257.7907 0.2184 0.1453 1.5425 2.8520 104.4633 15.7316 48.4011 0.0141 41.3321 5.1392 1.8987 28.9715 0.0781 0.8639 3.1830 23.7623 34.5955 83.9972 13.0137
temp: 298.150 k
press: 1.00000 atm
elementType: 16 15 7 7 6 6 6 6 6 6 6 6 6 6 6 6 6 6 1 1 1 1 1 1 1 1 1 1 1 1 1 1 1
symmnumber: 1
zpe: 676520.6 jmol-1
zpe.correction: 0.257673 hartree
zpe.thermalcorrener: 0.275174 hartree
zpe.thermalcorrenthalpy: 0.276118 hartree
zpe.thermalcorrgfe: 0.211587 hartree
zpe.sumelectzpe: -1390.022205 hartree
zpe.sumelectthermal: -1390.004705 hartree
zpe.sumelectthermalent: -1390.003760 hartree
zpe.sumelectthermalfe: -1390.068292 hartree
dipole: -0.3589 -4.0844 0.0225
dipole: 4.1002
quadrupole: -105.5996 -130.2061 -112.3081
quadrupole: -7.6827 0.1098 0.2763
quadrupole: 10.4383 -14.1682 3.7298 -7.6827 0.1098 0.2763
hfenergy: -1390.2798784 hartree
pointgroup: C01 [X(C14H15N2P1S1)]
dipole: -0.0233343 1.6120648 0.0537049 debye
polarizability: 300.9444129|33.4251661|199.976525|-5.5373156|0.0687615|140.326462 unknown
InChI: InChI=1S/C14H15N2PS/c1-10-8-13-14(9-11(10)2)16-17(18,15-13)12-6-4-3-5-7-12/h3-9,15-16H,1-2H3
charge 0 multiplicity 1
33 atoms
S  -1.644954 -3.367965 0.03645
P  -1.087893 -1.35776 0.082126
N  -0.011454 -0.716718 -1.173093
N  0.09074 -0.806185 1.2872
C  1.2506 -0.291428 -0.689914
C  1.30933 -0.342217 0.733516
C  -2.559712 -0.215529 0.179209
C  2.368375 0.135365 -1.428508
C  2.484972 0.035245 1.406365
C  3.556802 0.528139 -0.756543
C  3.615492 0.477818 0.668712
C  -2.346272 1.183954 0.198953
C  -3.864037 -0.753455 0.230034
C  4.756093 0.996184 -1.563815
C  4.878574 0.890963 1.405395
C  -3.458056 2.051252 0.269847
C  -4.971869 0.121419 0.301008
C  -4.770022 1.521132 0.320657
H  -0.179549 -0.903364 -2.160358
H  0.004327 -1.064517 2.26877
H  2.327584 0.168421 -2.523404
H  2.533544 -0.00842 2.500556
H  -1.328117 1.586195 0.158196
H  -3.991518 -1.842571 0.212436
H  5.04492 2.033649 -1.305143
H  5.64644 0.36426 -1.378448
H  4.545944 0.967767 -2.646726
H  5.154098 1.941673 1.189442
H  4.755289 0.795081 2.497797
H  5.746237 0.269257 1.110294
H  -3.303097 3.135511 0.284968
H  -5.987001 -0.288065 0.340336
H  -5.630308 2.197713 0.37499
