program: Gaussian 09
title: 000258930
version: EM64L-G09RevD.01
frameworkgroup: C1[X(C13H10F3N2OP)]
method: RPBEPBE
basis: SDD
operation: Freq
keyword: #p
keyword: freq=noraman
keyword: PBEPBE/SDD
title: #p freq=noraman PBEPBE/SDD
converged: YES YES NO NO
title: Mulliken charges:
elementType: P F F F O N N C C C C C C C C C C C C C H H H H H H H H H H
charge: 1.203406 -0.168942 -0.173158 -0.174230 -0.566548 -0.853633 -0.840159 0.413382 0.378152 -0.110405 -0.494587 -0.346017 0.345815 -0.359948 -0.262340 -0.297731 0.241643 -0.218120 -0.205767 -0.218417 0.338186 0.334943 0.262773 0.236532 0.259809 0.265543 0.291043 0.240259 0.239912 0.238606
chargesum: 0.00000
title: Mulliken charges with hydrogens summed into heavy atoms:
elementType: P F F F O N N C C C C C C C C C C C C C
charge: 1.203406 -0.168942 -0.173158 -0.174230 -0.566548 -0.515447 -0.505216 0.413382 0.378152 -0.110405 -0.231814 -0.109486 0.345815 -0.100139 0.003202 -0.006688 0.241643 0.022139 0.034146 0.020189
polarizability: 2.74191892e+02 4.91649278e+00 1.45159270e+02 1.37476039e+01 3.84092402e+00 1.29733412e+02
1716.lowfreq: -9.4775 -3.3089 -0.0007 0.0014 0.0017 3.8904 20.6984 27.6983 33.9554
frequency: 19.5546 27.6596 33.8473 56.5331 90.8997 129.3891 148.1642 163.0463 212.8439 219.9530 241.9036 251.3169 289.4982 327.5614 334.0778 370.4321 397.0723 405.9379 406.4514 432.4398 476.7091 486.7948 500.5417 512.2581 520.8094 537.0955 593.5436 609.0872 616.8433 634.8739 684.2448 694.4469 702.3550 755.5704 760.1371 765.9356 778.3682 816.3168 820.1944 862.4817 878.9203 897.0696 935.7563 942.1856 967.7585 986.8070 990.9008 1010.4242 1011.3724 1016.8698 1024.7121 1041.3606 1081.4685 1090.3857 1137.9761 1175.8926 1187.6632 1206.8742 1219.5555 1256.5256 1299.2692 1311.4416 1317.0961 1331.7360 1383.0115 1425.0721 1429.6097 1464.6283 1477.2580 1514.8003 1589.0909 1594.3312 1603.9174 1626.7047 3132.8960 3139.4012 3148.2168 3150.4792 3158.8939 3162.3935 3171.4373 3176.3893 3607.8208 3610.5467
redmass: 15.0622 6.7279 4.1436 5.1228 7.5768 9.9054 7.2810 6.3237 3.8805 7.2441 7.1614 10.3486 5.8130 7.7321 9.2859 7.8734 2.7843 5.3525 4.9731 2.5161 2.5987 5.1424 2.0345 2.0838 6.8494 3.6435 11.3054 6.5773 7.7881 4.7591 9.5730 7.4498 2.0418 2.5177 2.2467 6.3400 3.6493 1.4831 4.0776 1.2472 1.5474 6.7929 1.3994 1.3617 9.2037 6.1442 1.3816 5.2982 1.3336 4.4579 4.1565 3.8589 1.6808 2.8824 1.5895 1.0569 1.1279 2.4318 1.3878 1.5953 2.3368 1.3217 1.4564 4.1517 9.4232 3.4903 2.1319 2.0470 4.4762 4.3475 6.1680 5.8064 6.8040 7.2991 1.0856 1.0884 1.0926 1.0894 1.0968 1.0928 1.1017 1.0962 1.0783 1.0791
irintensity: 0.3034 0.7106 0.1535 0.1613 0.6186 2.5079 2.6970 1.0285 0.4599 5.3339 4.0724 13.5026 0.8678 17.1995 2.0362 11.7084 0.0917 10.8961 5.2226 36.2333 10.5330 8.4116 53.5818 33.6307 14.8701 235.2217 18.4956 3.1918 26.3809 15.0441 2.7171 22.3912 42.9965 29.5328 42.1644 71.0583 9.2883 72.7516 155.6555 0.9723 47.7080 97.8022 7.8206 1.4526 221.4383 1.5657 0.8885 165.7675 0.3022 57.3274 94.3713 107.0990 3.6854 69.0506 28.3042 0.0778 10.7372 162.8840 11.3479 62.6615 59.9820 14.0092 135.9839 634.4661 0.8858 3.2583 22.7071 8.8426 158.6145 175.3318 0.1318 0.8165 1.1915 32.7382 0.1784 3.3669 5.3263 6.6478 14.8155 2.2996 27.4298 2.5140 86.8082 40.7930
temp: 298.150 k
press: 1.00000 atm
elementType: 15 9 9 9 8 7 7 6 6 6 6 6 6 6 6 6 6 6 6 6 1 1 1 1 1 1 1 1 1 1
symmnumber: 1
zpe: 547734.8 jmol-1
zpe.correction: 0.208621 hartree
zpe.thermalcorrener: 0.226004 hartree
zpe.thermalcorrenthalpy: 0.226948 hartree
zpe.thermalcorrgfe: 0.161244 hartree
zpe.sumelectzpe: -1325.464065 hartree
zpe.sumelectthermal: -1325.446682 hartree
zpe.sumelectthermalent: -1325.445738 hartree
zpe.sumelectthermalfe: -1325.511442 hartree
dipole: -5.7914 2.4461 2.1438
dipole: 6.6423
quadrupole: -130.3947 -130.6032 -111.4840
quadrupole: -16.5236 1.5159 -6.0588
quadrupole: -6.2341 -6.4426 12.6766 -16.5236 1.5159 -6.0588
hfenergy: -1325.6726859 hartree
pointgroup: C01 [X(C13H10F3N2O1P1)]
dipole: -2.3751174 0.3697512 1.0253464 debye
polarizability: 270.4208828|-6.1101163|137.0634982|26.224375|7.8877802|141.6001926 unknown
InChI: InChI=1S/C13H10F3N2OP/c14-13(15,16)9-6-7-11-12(8-9)18-20(19,17-11)10-4-2-1-3-5-10/h1-8,17-18H
charge 0 multiplicity 1
30 atoms
P  -1.671086 -0.830602 -1.076153
F  5.489672 -0.335268 0.828831
F  4.864781 1.095913 -0.826542
F  4.534949 1.651432 1.341379
O  -2.162291 -1.702404 -2.322444
N  -0.268141 0.23529 -1.268647
N  -0.787745 -1.639331 0.236977
C  0.851261 -0.127388 -0.492184
C  0.546124 -1.222367 0.384664
C  -3.072528 0.141821 -0.343442
C  2.13227 0.441182 -0.503882
C  1.532242 -1.747604 1.241231
C  3.115233 -0.088478 0.374793
C  2.821085 -1.168174 1.238314
C  -2.864207 0.98929 0.770064
C  -4.351278 0.008343 -0.932713
C  4.463704 0.553152 0.423119
C  -3.955486 1.711566 1.300526
C  -5.437263 0.735336 -0.395336
C  -5.239804 1.584381 0.71859
H  -0.212215 0.940786 -2.000917
H  -1.157507 -2.452173 0.726754
H  2.379632 1.266567 -1.178045
H  1.308241 -2.591284 1.901437
H  3.59857 -1.564149 1.897445
H  -1.867615 1.085501 1.215461
H  -4.475868 -0.655804 -1.795122
H  -3.80584 2.370513 2.162258
H  -6.431736 0.639677 -0.84375
H  -6.083756 2.146778 1.133132
